Aufzeichnungennpmip-address10.7.0
Welches Symbol wo lief
Symbole × Betriebssysteme für diese Version. Zellen führen in den Kompatibilitätswürfel des Pakets.
| debian glibc | ubuntu glibc | |
|---|---|---|
| Address6.endAddress | 100%1 | |
| Address6.fromAddress4 | 100%1 | |
| AddressError | 100%1 | 100%3 |
| ip-address.Address4 | 100%1 | 100%3 |
| ip-address.Address6 | 100%5 | |
| ip-address.AddressError | 100%3 |
Gezeigt werden die Umgebungen mit der meisten Evidenz.
Eine Zelle lesen: Die Zahl sind die aufgezeichneten Beobachtungen, durch die die Rate teilt — ein Build hinterlässt pro erreichter Stufe eine Beobachtung, also zählt sie weder Builds noch Maschinen noch Personen. Das Dokument daneben ist eine andere Tatsache aus einer anderen Quelle: ob an dieser Koordinate ein Sample existiert und wie unser eigener Lauf davon dort ausging.
- an dieser Koordinate noch kein Sample
- hier gibt es ein Sample, und wir haben es an dieser Koordinate noch nicht ausgeführt
- hier gibt es ein Sample, und unser Lauf an dieser Koordinate kam sauber zurück
- hier gibt es ein Sample, und unser Lauf an dieser Koordinate ist fehlgeschlagen
- hier gibt es ein Sample, und an dieser Koordinate sind ein bestandener und ein fehlgeschlagener Lauf verzeichnet
- nichts aufgezeichnet — unbekannt, weder „funktioniert“ noch „defekt“
- unter dieser Zelle liegt eine Ebene — zum Öffnen klicken
Ein Dokument bedeutet: An dieser Koordinate gibt es ein Sample. DASS es existiert, ist eine Aussage über diese Version und diese API und ändert sich nicht mit Betriebssystem, Runtime oder Paketmanager; seine FARBE sagt, wie dieses Sample in der Umgebung gelaufen ist, die Sie gerade ansehen.
Umgebungsdetails
Beobachtungen auf Projektebene und Symbol-/Contract-Verifizierungen werden getrennt gezählt und niemals zusammengerechnet.
Diese Zahlen unterscheiden nicht, wie das Symbol aufgerufen wurde: Überladungen, Argumentformen und Optionen werden zusammengefasst. Was eine bestimmte Aufrufform tut, beweist der Vertrag eines Samples – nicht diese Zahlen.
| Umgebung | Konfidenz | Beobachtungen | Verifiziert | Erfolgsquote | Peers | Zuletzt gesehen |
|---|---|---|---|---|---|---|
| node 22 · JS · npm · linux glibc · docker
Beobachtungen: PROJECT_LOAD 2✓ · PROJECT_TEST 2✓ — Nutzung: USED 2✓ — Verifiziert: CONTRACT 2✓
|
LOW | 4 +2 | 2 | 100 % | 1 · 1✓ | 2026-09-17 |
| node 22 · JS · npm · linux glibc · docker
Beobachtungen: PROJECT_LOAD 2✓ · PROJECT_TEST 2✓ — Nutzung: USED 2✓ — Verifiziert: CONTRACT 6✓
|
LOW | 4 +2 | 6 | 100 % | 1 · 1✓ | 2026-09-17 |
| node 22.23 · JS · npm · linux glibc
Beobachtungen: PROJECT_PROCESS 45✓ — Nutzung: USED 5✓ — Verifiziert: UNKNOWN 0✓ 9✕
|
MEDIUM | 45 +5 | 9 | 83 % | 3 | 2026-09-07 |
| node 22.23 · JS · npm · linux glibc
Beobachtungen: PROJECT_PROCESS 11✓ — Nutzung: USED 3✓
|
MEDIUM | 11 +3 | 0 | 100 % | 2 | 2026-09-14 |
Aktuelle Fehler-Cluster
-
beobachtet UNKNOWN exit 1 Beweislücke ×6 10.4.0 → 10.5.0 → 10.7.0 executionContext=node · moduleSystem=cjs · os=linux · runtime=node@22.23 sha256:91ad26545eb1…node:internal/modules/cjs/loader:<n> · throw err; · ^ · Error: Cannot find module <str>node · unclassified-diagnostic · outer node · gap stage-unknownBeweisqualität: complete · Umgebungsvarianten: 1 · Zuerst erfasst: 2026-08-30 · Zuletzt gesehen: 2026-09-07Kandidat für diagnostische Neuprüfung
-
beobachtet UNKNOWN exit 1 Beweislücke ×1 10.7.0 executionContext=node · moduleSystem=cjs · os=linux · runtime=node@22.23 sha256:d2d7a684aeb0…<url>]:<n> · console.log(<str>, addr.toBigInt().toString(16)); · ^ · TypeError: addr.toBigInt is not a functionnode · unclassified-diagnostic · outer node · gap stage-unknownBeweisqualität: complete · Umgebungsvarianten: 1 · Zuerst erfasst: 2026-09-07 · Zuletzt gesehen: 2026-09-07Kandidat für diagnostische Neuprüfung
-
beobachtet UNKNOWN exit 1 Beweislücke ×1 10.7.0 executionContext=node · moduleSystem=cjs · os=linux · runtime=node@22.23 sha256:e5f751e72b4c…<path>:<n> · if (address.indexOf(<str>) === -1) { · ^ · TypeError: address.indexOf is not a functionnode · unclassified-diagnostic · outer node · gap stage-unknownBeweisqualität: complete · Umgebungsvarianten: 1 · Zuerst erfasst: 2026-09-07 · Zuletzt gesehen: 2026-09-07Kandidat für diagnostische Neuprüfung
-
beobachtet UNKNOWN exit 1 ERR_ASSERTION Beweislücke ×1 10.7.0 executionContext=node · moduleSystem=cjs · os=linux · runtime=node@22.23 sha256:0ab3a7004d66…node:assert:<n> · throw new AssertionError(obj); · ^ · AssertionError [ERR_ASSERTION]: Expected values to be strictly equal:node · unclassified-diagnostic · outer node · gap stage-unknownBeweisqualität: complete · Umgebungsvarianten: 1 · Zuerst erfasst: 2026-09-07 · Zuletzt gesehen: 2026-09-07Kandidat für diagnostische Neuprüfung
-
beobachtet UNKNOWN exit 1 ERR_ASSERTION Beweislücke ×1 10.7.0 executionContext=node · moduleSystem=cjs · os=linux · runtime=node@22.23 sha256:0d62cac8c07a…AssertionError [ERR_ASSERTION]: Expected values to be strictly equal: · + actual - expected · + <str> · - <str>node · unclassified-diagnostic · outer node · gap stage-unknownBeweisqualität: complete · Umgebungsvarianten: 1 · Zuerst erfasst: 2026-09-07 · Zuletzt gesehen: 2026-09-07Kandidat für diagnostische Neuprüfung
-
beobachtet UNKNOWN exit 1 Beweislücke ×1 10.7.0 executionContext=node · moduleSystem=cjs · os=linux · runtime=node@22.23 ip-address.Address6 sha256:2f5423e9a8a8…<path>:<n> · assert.equal(mapped.isValid(), true); · ^ · TypeError: mapped.isValid is not a functionnode · unclassified-diagnostic · outer node · gap stage-unknownBeweisqualität: complete · Umgebungsvarianten: 1 · Zuerst erfasst: 2026-09-07 · Zuletzt gesehen: 2026-09-07Kandidat für diagnostische Neuprüfung
-
beobachtet UNKNOWN exit 1 ERR_ASSERTION Beweislücke ×1 10.7.0 executionContext=node · moduleSystem=cjs · os=linux · runtime=node@22.23 sha256:719dc399517f…AssertionError [ERR_ASSERTION]: Expected values to be strictly equal: · 8080 !== 38853 · at runTests (<path>:<n>:<n>) …node · unclassified-diagnostic · outer node · gap stage-unknownBeweisqualität: complete · Umgebungsvarianten: 1 · Zuerst erfasst: 2026-09-07 · Zuletzt gesehen: 2026-09-07Kandidat für diagnostische Neuprüfung
-
beobachtet UNKNOWN exit 1 ERR_ASSERTION Beweislücke ×1 10.7.0 executionContext=node · moduleSystem=cjs · os=linux · runtime=node@22.23 sha256:821bb102fcd0…node:assert:<n> · throw err; · ^ · AssertionError [ERR_ASSERTION]: The input did not match the regular expression <path> of the internal SmartBuffer/. Input:node · unclassified-diagnostic · outer node · gap stage-unknownBeweisqualität: complete · Umgebungsvarianten: 1 · Zuerst erfasst: 2026-09-07 · Zuletzt gesehen: 2026-09-07Kandidat für diagnostische Neuprüfung
-
beobachtet UNKNOWN exit 1 ERR_ASSERTION Beweislücke ×1 10.7.0 executionContext=node · moduleSystem=cjs · os=linux · runtime=node@22.23 sha256:cf0f5652a811…Contract test failed: AssertionError [ERR_ASSERTION]: should reject non-connect command · at async testContract (<url>) { · generatedMessage: false, …node · unclassified-diagnostic · outer node · gap stage-unknownBeweisqualität: complete · Umgebungsvarianten: 1 · Zuerst erfasst: 2026-09-07 · Zuletzt gesehen: 2026-09-07Kandidat für diagnostische Neuprüfung
Symbole
- ip-address.Address4 1 1 von 1 Läufen bestanden
- ip-address.Address6 0 von 1 Läufen bestanden
- ip-address.AddressError 1 0 von 1 Läufen bestanden
- Address6.endAddress 1 1 von 1 Läufen bestanden
- Address6.fromAddress4 1 1 von 1 Läufen bestanden
- Address6.fromURL 1 1 von 1 Läufen bestanden
- Address6.isInSubnet 1 1 von 1 Läufen bestanden
- Address6.startAddress 1 1 von 1 Läufen bestanden
Veröffentlichte Beispiele
- ip-address 10.7.0 Dieses Netzwerk bietet eine Sache: ein Sample, das baut. Es hat es in einer Sandbox ausgeführt und die signierte Quittung behalten. Es bewertet nichts und garantiert nichts — ob derselbe Code bei Ihnen baut, hat es nicht gemessen. HOW MIT-0 · 2026-09-07
- ip-address 10.7.0 Dieses Netzwerk bietet eine Sache: ein Sample, das baut. Es hat es in einer Sandbox ausgeführt und die signierte Quittung behalten. Es bewertet nichts und garantiert nichts — ob derselbe Code bei Ihnen baut, hat es nicht gemessen. HOW MIT-0 · 2026-09-07
- ip-address 10.7.0 Dieses Netzwerk bietet eine Sache: ein Sample, das baut. Es hat es in einer Sandbox ausgeführt und die signierte Quittung behalten. Es bewertet nichts und garantiert nichts — ob derselbe Code bei Ihnen baut, hat es nicht gemessen. HOW MIT-0 · 2026-09-07