記録npmcollect-v8-coverage1.0.3collect-v8-coverage.CoverageInstrumenter
公開したサンプル
- collect-v8-coverage 1.0.3: collect v8 code coverage with CoverageInstrumenter このネットワークが提供するのは一つだけです。ビルドされるサンプル。サンドボックスで実行し、署名済みの受領証を保管します。等級はつけず、何も保証しません — 同じコードがあなたの環境でビルドされるかは測定していません。 HOWCoverageInstrumenternode 22.23.2 MIT-0 · 2026-08-26
互換性マトリクス
プロジェクトレベルの観測とシンボル/コントラクト検証は別々に集計し、決して合算しません。
これらの数値は、シンボルがどう呼び出されたかを区別しません。オーバーロード、引数の形、オプションはまとめて集計されます。特定の呼び出し方がどう動くかは、この数値ではなくサンプルの契約が証明します。
| 環境 | 信頼度 | 観測 | 検証 | 成功率 | ピア | 最終観測 |
|---|---|---|---|---|---|---|
| node 22.23 · JS · npm · linux glibc
観測: PROJECT_PROCESS 20✓ — 検証: UNKNOWN 0✓ 15✕
|
ELEVATED FAILURE | 20 | 15 | 57% | 3 | 2026-08-30 |
snapshot · 2026-09-15
失敗クラスター
-
観測済み UNKNOWN exit 1 証拠の欠落 ×5 1.0.3 executionContext=node · moduleSystem=cjs · os=linux · runtime=node@22.23 collect-v8-coverage.CoverageInstrumenter sha256:91ad26545eb1…node:internal/modules/cjs/loader:<n> · throw err; · ^ · Error: Cannot find module <str>node · unclassified-diagnostic · outer node · gap stage-unknown証拠品質: complete · 環境バリアント: 1 · 初回記録: 2026-08-30 · 最終観測: 2026-08-31診断再検証候補
-
観測済み UNKNOWN exit 1 ERR_MODULE_NOT_FOUND 証拠の欠落 ×4 1.0.3 executionContext=node · moduleSystem=cjs · os=linux · runtime=node@22.23 collect-v8-coverage.CoverageInstrumenter sha256:88af852f99a8…node:internal/modules/package_json_reader:<n> · throw new ERR_MODULE_NOT_FOUND(packageName, fileURLToPath(base), null); · ^ …node · unclassified-diagnostic · outer node · gap stage-unknown証拠品質: complete · 環境バリアント: 1 · 初回記録: 2026-08-29 · 最終観測: 2026-08-30診断再検証候補
-
観測済み UNKNOWN exit 1 証拠の欠落 ×1 1.0.3 executionContext=node · moduleSystem=cjs · os=linux · runtime=node@22.23 collect-v8-coverage.CoverageInstrumenter sha256:8310a83be884…node:internal/modules/cjs/loader:<n> · const err = new Error(message); · ^ · Error: Cannot find module <str>node · unclassified-diagnostic · outer node · gap stage-unknown証拠品質: complete · 環境バリアント: 1 · 初回記録: 2026-08-29 · 最終観測: 2026-08-29診断再検証候補
-
観測済み UNKNOWN exit 1 証拠の欠落 ×1 1.0.3 executionContext=node · moduleSystem=cjs · os=linux · runtime=node@22.23 collect-v8-coverage.CoverageInstrumenter sha256:9922ca80f240…go: <path> already existsgo · unclassified-diagnostic · outer go mod · gap stage-unknown証拠品質: complete · 環境バリアント: 1 · 初回記録: 2026-08-29 · 最終観測: 2026-08-29診断再検証候補
-
観測済み UNKNOWN exit 1 証拠の欠落 ×1 1.0.3 executionContext=node · moduleSystem=cjs · os=linux · runtime=node@22.23 collect-v8-coverage.CoverageInstrumenter sha256:f9f43a3adeb5…<path>:<n> · throw new TypeError(<str> + version) · ^ · TypeError: Invalid Version: invalidnode · unclassified-diagnostic · outer node · gap stage-unknown証拠品質: complete · 環境バリアント: 1 · 初回記録: 2026-08-30 · 最終観測: 2026-08-30診断再検証候補
-
観測済み UNKNOWN exit 1 ERR_ASSERTION 証拠の欠落 ×1 1.0.3 executionContext=node · moduleSystem=cjs · os=linux · runtime=node@22.23 collect-v8-coverage.CoverageInstrumenter sha256:07e974cf28d4…Test failed: AssertionError [ERR_ASSERTION]: getFeedURL should return configured feed url · + actual - expected · + <str> · - <str>node · unclassified-diagnostic · outer node · gap stage-unknown証拠品質: complete · 環境バリアント: 1 · 初回記録: 2026-08-30 · 最終観測: 2026-08-30診断再検証候補
-
観測済み UNKNOWN exit 1 証拠の欠落 ×1 1.0.3 executionContext=node · moduleSystem=cjs · os=linux · runtime=node@22.23 collect-v8-coverage.CoverageInstrumenter sha256:1c03ca490615…Traceback (most recent call last): · File <str>, line 3, in <module> · AttributeError: module <str> has no attribute <str> · IANA_VERSION: <str>python · unclassified-diagnostic · outer python · gap stage-unknown証拠品質: complete · 環境バリアント: 1 · 初回記録: 2026-08-30 · 最終観測: 2026-08-30診断再検証候補
-
観測済み UNKNOWN exit 1 証拠の欠落 ×1 1.0.3 executionContext=node · moduleSystem=cjs · os=linux · runtime=node@22.23 collect-v8-coverage.CoverageInstrumenter sha256:9be950af9140…Traceback (most recent call last): · File <str>, line 1, in <module> · ModuleNotFoundError: No module named <str>python3 · unclassified-diagnostic · outer python3 · gap stage-unknown証拠品質: complete · 環境バリアント: 1 · 初回記録: 2026-08-30 · 最終観測: 2026-08-30診断再検証候補
-
観測済み UNKNOWN exit 1 証拠の欠落 ×1 1.0.3 executionContext=node · moduleSystem=cjs · os=linux · runtime=node@22.23 collect-v8-coverage.CoverageInstrumenter sha256:d296ed2b3573…Traceback (most recent call last): · File <str>, line 5, in <module> · ModuleNotFoundError: No module named <str> · IANA_VERSION: <str>python · unclassified-diagnostic · outer python · gap stage-unknown証拠品質: complete · 環境バリアント: 1 · 初回記録: 2026-08-30 · 最終観測: 2026-08-30診断再検証候補
-
観測済み UNKNOWN exit 1 ERR_ASSERTION 証拠の欠落 ×1 1.0.3 executionContext=node · moduleSystem=esm · os=linux · runtime=node@22.23 sha256:054c93088b95…node:internal/modules/run_main:<n> · triggerUncaughtException( · ^ …node · unclassified-diagnostic · outer node · gap stage-unknown証拠品質: complete · 環境バリアント: 1 · 初回記録: 2026-08-31 · 最終観測: 2026-08-31診断再検証候補
-
観測済み UNKNOWN exit 1 ERR_ASSERTION 証拠の欠落 ×1 1.0.3 executionContext=node · moduleSystem=cjs · os=linux · runtime=node@22.23 sha256:eb0938a47430…node:assert:<n> · throw new AssertionError(obj); · ^ · AssertionError [ERR_ASSERTION]: jest.getVersion() should return 29.6.3node · unclassified-diagnostic · outer node · gap stage-unknown証拠品質: complete · 環境バリアント: 1 · 初回記録: 2026-08-31 · 最終観測: 2026-08-31診断再検証候補
-
観測済み UNKNOWN exit 1 ERR_ASSERTION 証拠の欠落 ×1 1.0.3 executionContext=node · moduleSystem=cjs · os=linux · runtime=node@22.23 sha256:769e5b509341…node:internal/process/promises:<n> · triggerUncaughtException(err, true <path> fromPromise */); · ^ …node · unclassified-diagnostic · outer node · gap stage-unknown証拠品質: complete · 環境バリアント: 1 · 初回記録: 2026-08-31 · 最終観測: 2026-08-31診断再検証候補
最も多く報告された 12 件を表示しています。この座標に記録された失敗クラスタは 14 件です。残りは単発の報告です。