Registrosnpmcollect-v8-coverage1.0.3collect-v8-coverage.CoverageInstrumenter
Ejemplos publicados
- collect-v8-coverage 1.0.3: collect v8 code coverage with CoverageInstrumenter Esta red ofrece una sola cosa: una muestra que compila. La ejecutó en un sandbox y guardó el recibo firmado. No califica ni garantiza nada: si el mismo código compila donde estás no es algo que haya medido. HOWCoverageInstrumenternode 22.23.2 MIT-0 · 2026-08-26
Matriz de compatibilidad
Las observaciones a nivel de proyecto y las verificaciones de símbolo/contrato se cuentan por separado y nunca se combinan.
Estos recuentos no distinguen cómo se llamó al símbolo: las sobrecargas, las formas de los argumentos y las opciones se agrupan. Lo que hace una forma de llamada concreta lo demuestra el contrato de una muestra, no estas cifras.
| Entorno | Confianza | Observaciones | Verificado | Tasa de éxito | Pares | Última observación |
|---|---|---|---|---|---|---|
| node 22.23 · JS · npm · linux glibc
Observaciones: PROJECT_PROCESS 20✓ — Verificado: UNKNOWN 0✓ 15✕
|
ELEVATED FAILURE | 20 | 15 | 57% | 3 | 2026-08-30 |
snapshot · 2026-09-15
Clústeres de fallos
-
observado UNKNOWN exit 1 Brecha de evidencia ×5 1.0.3 executionContext=node · moduleSystem=cjs · os=linux · runtime=node@22.23 collect-v8-coverage.CoverageInstrumenter sha256:91ad26545eb1…node:internal/modules/cjs/loader:<n> · throw err; · ^ · Error: Cannot find module <str>node · unclassified-diagnostic · outer node · gap stage-unknownCalidad de evidencia: complete · Variantes de entorno: 1 · Primer registro: 2026-08-30 · Última observación: 2026-08-31Candidato a reverificación diagnóstica
-
observado UNKNOWN exit 1 ERR_MODULE_NOT_FOUND Brecha de evidencia ×4 1.0.3 executionContext=node · moduleSystem=cjs · os=linux · runtime=node@22.23 collect-v8-coverage.CoverageInstrumenter sha256:88af852f99a8…node:internal/modules/package_json_reader:<n> · throw new ERR_MODULE_NOT_FOUND(packageName, fileURLToPath(base), null); · ^ …node · unclassified-diagnostic · outer node · gap stage-unknownCalidad de evidencia: complete · Variantes de entorno: 1 · Primer registro: 2026-08-29 · Última observación: 2026-08-30Candidato a reverificación diagnóstica
-
observado UNKNOWN exit 1 Brecha de evidencia ×1 1.0.3 executionContext=node · moduleSystem=cjs · os=linux · runtime=node@22.23 collect-v8-coverage.CoverageInstrumenter sha256:8310a83be884…node:internal/modules/cjs/loader:<n> · const err = new Error(message); · ^ · Error: Cannot find module <str>node · unclassified-diagnostic · outer node · gap stage-unknownCalidad de evidencia: complete · Variantes de entorno: 1 · Primer registro: 2026-08-29 · Última observación: 2026-08-29Candidato a reverificación diagnóstica
-
observado UNKNOWN exit 1 Brecha de evidencia ×1 1.0.3 executionContext=node · moduleSystem=cjs · os=linux · runtime=node@22.23 collect-v8-coverage.CoverageInstrumenter sha256:9922ca80f240…go: <path> already existsgo · unclassified-diagnostic · outer go mod · gap stage-unknownCalidad de evidencia: complete · Variantes de entorno: 1 · Primer registro: 2026-08-29 · Última observación: 2026-08-29Candidato a reverificación diagnóstica
-
observado UNKNOWN exit 1 Brecha de evidencia ×1 1.0.3 executionContext=node · moduleSystem=cjs · os=linux · runtime=node@22.23 collect-v8-coverage.CoverageInstrumenter sha256:f9f43a3adeb5…<path>:<n> · throw new TypeError(<str> + version) · ^ · TypeError: Invalid Version: invalidnode · unclassified-diagnostic · outer node · gap stage-unknownCalidad de evidencia: complete · Variantes de entorno: 1 · Primer registro: 2026-08-30 · Última observación: 2026-08-30Candidato a reverificación diagnóstica
-
observado UNKNOWN exit 1 ERR_ASSERTION Brecha de evidencia ×1 1.0.3 executionContext=node · moduleSystem=cjs · os=linux · runtime=node@22.23 collect-v8-coverage.CoverageInstrumenter sha256:07e974cf28d4…Test failed: AssertionError [ERR_ASSERTION]: getFeedURL should return configured feed url · + actual - expected · + <str> · - <str>node · unclassified-diagnostic · outer node · gap stage-unknownCalidad de evidencia: complete · Variantes de entorno: 1 · Primer registro: 2026-08-30 · Última observación: 2026-08-30Candidato a reverificación diagnóstica
-
observado UNKNOWN exit 1 Brecha de evidencia ×1 1.0.3 executionContext=node · moduleSystem=cjs · os=linux · runtime=node@22.23 collect-v8-coverage.CoverageInstrumenter sha256:1c03ca490615…Traceback (most recent call last): · File <str>, line 3, in <module> · AttributeError: module <str> has no attribute <str> · IANA_VERSION: <str>python · unclassified-diagnostic · outer python · gap stage-unknownCalidad de evidencia: complete · Variantes de entorno: 1 · Primer registro: 2026-08-30 · Última observación: 2026-08-30Candidato a reverificación diagnóstica
-
observado UNKNOWN exit 1 Brecha de evidencia ×1 1.0.3 executionContext=node · moduleSystem=cjs · os=linux · runtime=node@22.23 collect-v8-coverage.CoverageInstrumenter sha256:9be950af9140…Traceback (most recent call last): · File <str>, line 1, in <module> · ModuleNotFoundError: No module named <str>python3 · unclassified-diagnostic · outer python3 · gap stage-unknownCalidad de evidencia: complete · Variantes de entorno: 1 · Primer registro: 2026-08-30 · Última observación: 2026-08-30Candidato a reverificación diagnóstica
-
observado UNKNOWN exit 1 Brecha de evidencia ×1 1.0.3 executionContext=node · moduleSystem=cjs · os=linux · runtime=node@22.23 collect-v8-coverage.CoverageInstrumenter sha256:d296ed2b3573…Traceback (most recent call last): · File <str>, line 5, in <module> · ModuleNotFoundError: No module named <str> · IANA_VERSION: <str>python · unclassified-diagnostic · outer python · gap stage-unknownCalidad de evidencia: complete · Variantes de entorno: 1 · Primer registro: 2026-08-30 · Última observación: 2026-08-30Candidato a reverificación diagnóstica
-
observado UNKNOWN exit 1 ERR_ASSERTION Brecha de evidencia ×1 1.0.3 executionContext=node · moduleSystem=esm · os=linux · runtime=node@22.23 sha256:054c93088b95…node:internal/modules/run_main:<n> · triggerUncaughtException( · ^ …node · unclassified-diagnostic · outer node · gap stage-unknownCalidad de evidencia: complete · Variantes de entorno: 1 · Primer registro: 2026-08-31 · Última observación: 2026-08-31Candidato a reverificación diagnóstica
-
observado UNKNOWN exit 1 ERR_ASSERTION Brecha de evidencia ×1 1.0.3 executionContext=node · moduleSystem=cjs · os=linux · runtime=node@22.23 sha256:eb0938a47430…node:assert:<n> · throw new AssertionError(obj); · ^ · AssertionError [ERR_ASSERTION]: jest.getVersion() should return 29.6.3node · unclassified-diagnostic · outer node · gap stage-unknownCalidad de evidencia: complete · Variantes de entorno: 1 · Primer registro: 2026-08-31 · Última observación: 2026-08-31Candidato a reverificación diagnóstica
-
observado UNKNOWN exit 1 ERR_ASSERTION Brecha de evidencia ×1 1.0.3 executionContext=node · moduleSystem=cjs · os=linux · runtime=node@22.23 sha256:769e5b509341…node:internal/process/promises:<n> · triggerUncaughtException(err, true <path> fromPromise */); · ^ …node · unclassified-diagnostic · outer node · gap stage-unknownCalidad de evidencia: complete · Variantes de entorno: 1 · Primer registro: 2026-08-31 · Última observación: 2026-08-31Candidato a reverificación diagnóstica
Se muestran los 12 más reportados de 14 grupos de fallos registrados. El resto son reportes únicos.