Записиnpmcollect-v8-coverage1.0.3CoverageInstrumenter
OS × среда выполнения одним взглядом
Как читать ячейку: Число — это записанные наблюдения, на которые делится доля: одна сборка оставляет по наблюдению на каждый достигнутый этап, поэтому это не число сборок, не число машин и не число людей. Документ рядом — другой факт из другого источника: есть ли в этой координате образец и чем закончился наш запуск его там.
- в этой координате образца пока нет
- образец есть — в этой координате мы его ещё не запускали
- образец есть — наш запуск в этой координате завершился чисто
- образец есть — наш запуск в этой координате не прошёл
- образец есть — в этой координате записаны и успешный, и неуспешный запуск
- ничего не записано — неизвестно, а не «работает» и не «сломано»
- под этой ячейкой есть уровень — нажмите, чтобы открыть
Документ означает, что в этой координате есть образец. Его НАЛИЧИЕ — это факт об этой версии и этом API, оно не меняется от ОС, среды выполнения или пакетного менеджера; ЦВЕТ говорит, как этот образец отработал в том окружении, которое вы сейчас смотрите.
Опубликованные примеры
- collect-v8-coverage 1.0.3: collect v8 code coverage with CoverageInstrumenter Эта сеть предлагает одно: образец, который собирается. Она запустила его в песочнице и сохранила подписанную квитанцию. Она ничего не оценивает и ничего не гарантирует — собирается ли тот же код у вас, она не измеряла. HOWCoverageInstrumenternode 22.23.2 MIT-0 · 2026-08-26
Матрица совместимости
Наблюдения уровня проекта и проверки символов/контрактов считаются раздельно и никогда не суммируются.
Эти числа не различают, как именно был вызван символ: перегрузки, наборы аргументов и опции считаются вместе. Что делает конкретная форма вызова, доказывает контракт образца, а не эти цифры.
| Окружение | Достоверность | Наблюдения | Проверено | Доля успешных | Пиры | Последнее наблюдение |
|---|---|---|---|---|---|---|
| node 22 · JS · npm · linux glibc · docker
Наблюдения: PROJECT_TEST 1✓ — Проверено: CONTRACT 1✓
|
LOW | 1 | 1 | 100 % | 1 · 1✓ | 2026-09-08 |
| node 22 · JS · npm · linux musl · docker
Проверено: CONTRACT 1✓
|
LOW | 0 | 1 | 100 % | 0 · 1✓ | 2026-08-26 |
| node 22.23 · JS · npm · linux glibc
Наблюдения: PROJECT_PROCESS 20✓ — Проверено: UNKNOWN 0✓ 15✕
|
ELEVATED FAILURE | 20 | 15 | 57 % | 3 | 2026-08-30 |
snapshot · 2026-09-15
Кластеры сбоев
-
наблюдалось UNKNOWN exit 1 Пробел в данных ×5 1.0.3 executionContext=node · moduleSystem=cjs · os=linux · runtime=node@22.23 sha256:91ad26545eb1…node:internal/modules/cjs/loader:<n> · throw err; · ^ · Error: Cannot find module <str>node · unclassified-diagnostic · outer node · gap stage-unknownКачество данных: complete · Варианты среды: 1 · Первая запись: 2026-08-30 · Последнее наблюдение: 2026-08-31Кандидат на диагностическую перепроверку
-
наблюдалось UNKNOWN exit 1 ERR_MODULE_NOT_FOUND Пробел в данных ×4 1.0.3 executionContext=node · moduleSystem=cjs · os=linux · runtime=node@22.23 sha256:88af852f99a8…node:internal/modules/package_json_reader:<n> · throw new ERR_MODULE_NOT_FOUND(packageName, fileURLToPath(base), null); · ^ …node · unclassified-diagnostic · outer node · gap stage-unknownКачество данных: complete · Варианты среды: 1 · Первая запись: 2026-08-29 · Последнее наблюдение: 2026-08-30Кандидат на диагностическую перепроверку
-
наблюдалось UNKNOWN exit 1 Пробел в данных ×1 1.0.3 executionContext=node · moduleSystem=cjs · os=linux · runtime=node@22.23 sha256:8310a83be884…node:internal/modules/cjs/loader:<n> · const err = new Error(message); · ^ · Error: Cannot find module <str>node · unclassified-diagnostic · outer node · gap stage-unknownКачество данных: complete · Варианты среды: 1 · Первая запись: 2026-08-29 · Последнее наблюдение: 2026-08-29Кандидат на диагностическую перепроверку
-
наблюдалось UNKNOWN exit 1 Пробел в данных ×1 1.0.3 executionContext=node · moduleSystem=cjs · os=linux · runtime=node@22.23 sha256:9922ca80f240…go: <path> already existsgo · unclassified-diagnostic · outer go mod · gap stage-unknownКачество данных: complete · Варианты среды: 1 · Первая запись: 2026-08-29 · Последнее наблюдение: 2026-08-29Кандидат на диагностическую перепроверку
-
наблюдалось UNKNOWN exit 1 Пробел в данных ×1 1.0.3 executionContext=node · moduleSystem=cjs · os=linux · runtime=node@22.23 sha256:f9f43a3adeb5…<path>:<n> · throw new TypeError(<str> + version) · ^ · TypeError: Invalid Version: invalidnode · unclassified-diagnostic · outer node · gap stage-unknownКачество данных: complete · Варианты среды: 1 · Первая запись: 2026-08-30 · Последнее наблюдение: 2026-08-30Кандидат на диагностическую перепроверку
-
наблюдалось UNKNOWN exit 1 ERR_ASSERTION Пробел в данных ×1 1.0.3 executionContext=node · moduleSystem=cjs · os=linux · runtime=node@22.23 sha256:07e974cf28d4…Test failed: AssertionError [ERR_ASSERTION]: getFeedURL should return configured feed url · + actual - expected · + <str> · - <str>node · unclassified-diagnostic · outer node · gap stage-unknownКачество данных: complete · Варианты среды: 1 · Первая запись: 2026-08-30 · Последнее наблюдение: 2026-08-30Кандидат на диагностическую перепроверку
-
наблюдалось UNKNOWN exit 1 Пробел в данных ×1 1.0.3 executionContext=node · moduleSystem=cjs · os=linux · runtime=node@22.23 sha256:1c03ca490615…Traceback (most recent call last): · File <str>, line 3, in <module> · AttributeError: module <str> has no attribute <str> · IANA_VERSION: <str>python · unclassified-diagnostic · outer python · gap stage-unknownКачество данных: complete · Варианты среды: 1 · Первая запись: 2026-08-30 · Последнее наблюдение: 2026-08-30Кандидат на диагностическую перепроверку
-
наблюдалось UNKNOWN exit 1 Пробел в данных ×1 1.0.3 executionContext=node · moduleSystem=cjs · os=linux · runtime=node@22.23 sha256:9be950af9140…Traceback (most recent call last): · File <str>, line 1, in <module> · ModuleNotFoundError: No module named <str>python3 · unclassified-diagnostic · outer python3 · gap stage-unknownКачество данных: complete · Варианты среды: 1 · Первая запись: 2026-08-30 · Последнее наблюдение: 2026-08-30Кандидат на диагностическую перепроверку
-
наблюдалось UNKNOWN exit 1 Пробел в данных ×1 1.0.3 executionContext=node · moduleSystem=cjs · os=linux · runtime=node@22.23 sha256:d296ed2b3573…Traceback (most recent call last): · File <str>, line 5, in <module> · ModuleNotFoundError: No module named <str> · IANA_VERSION: <str>python · unclassified-diagnostic · outer python · gap stage-unknownКачество данных: complete · Варианты среды: 1 · Первая запись: 2026-08-30 · Последнее наблюдение: 2026-08-30Кандидат на диагностическую перепроверку
-
наблюдалось UNKNOWN exit 1 ERR_ASSERTION Пробел в данных ×1 1.0.3 executionContext=node · moduleSystem=esm · os=linux · runtime=node@22.23 sha256:054c93088b95…node:internal/modules/run_main:<n> · triggerUncaughtException( · ^ …node · unclassified-diagnostic · outer node · gap stage-unknownКачество данных: complete · Варианты среды: 1 · Первая запись: 2026-08-31 · Последнее наблюдение: 2026-08-31Кандидат на диагностическую перепроверку
-
наблюдалось UNKNOWN exit 1 ERR_ASSERTION Пробел в данных ×1 1.0.3 executionContext=node · moduleSystem=cjs · os=linux · runtime=node@22.23 sha256:eb0938a47430…node:assert:<n> · throw new AssertionError(obj); · ^ · AssertionError [ERR_ASSERTION]: jest.getVersion() should return 29.6.3node · unclassified-diagnostic · outer node · gap stage-unknownКачество данных: complete · Варианты среды: 1 · Первая запись: 2026-08-31 · Последнее наблюдение: 2026-08-31Кандидат на диагностическую перепроверку
-
наблюдалось UNKNOWN exit 1 ERR_ASSERTION Пробел в данных ×1 1.0.3 executionContext=node · moduleSystem=cjs · os=linux · runtime=node@22.23 sha256:769e5b509341…node:internal/process/promises:<n> · triggerUncaughtException(err, true <path> fromPromise */); · ^ …node · unclassified-diagnostic · outer node · gap stage-unknownКачество данных: complete · Варианты среды: 1 · Первая запись: 2026-08-31 · Последнее наблюдение: 2026-08-31Кандидат на диагностическую перепроверку
Показаны 12 наиболее часто сообщаемых из 14 записанных кластеров отказов. Остальные — единичные сообщения.