Relevésnpmcollect-v8-coverage1.0.3CoverageInstrumenter
OS × runtime en un coup d'œil
Lire une cellule : Le nombre, ce sont les observations enregistrées que le taux divise : une compilation dépose une observation par étape atteinte, ce n'est donc ni un nombre de builds, ni de machines, ni de personnes. Le document à côté est un autre fait, d'une autre source : l'existence d'un échantillon à cette coordonnée, et le résultat de notre exécution là-bas.
- pas encore d'échantillon à cette coordonnée
- il y a un échantillon ici et nous ne l'avons pas encore exécuté à cette coordonnée
- il y a un échantillon ici et notre exécution à cette coordonnée s'est terminée proprement
- il y a un échantillon ici et notre exécution à cette coordonnée a échoué
- il y a un échantillon ici et cette coordonnée enregistre à la fois une exécution réussie et une exécution en échec
- rien enregistré — inconnu, ni « fonctionne » ni « cassé »
- il y a un niveau sous cette case — cliquez pour l'ouvrir
Un document signifie qu'il y a un échantillon à cette coordonnée. Son EXISTENCE est un fait sur cette version et cette API et ne change pas avec l'OS, le runtime ou le gestionnaire de paquets ; sa COULEUR dit comment cet échantillon s'est exécuté dans l'environnement que vous regardez.
Exemples publiés
- collect-v8-coverage 1.0.3: collect v8 code coverage with CoverageInstrumenter Ce réseau offre une seule chose : un échantillon qui compile. Il l'a exécuté dans un bac à sable et conservé le reçu signé. Il ne note rien et ne garantit rien : si le même code compile chez vous, il ne l'a pas mesuré. HOWCoverageInstrumenternode 22.23.2 MIT-0 · 2026-08-26
Matrice de compatibilité
Les observations au niveau projet et les vérifications de symbole/contrat sont comptées séparément et jamais additionnées.
Ces chiffres ne distinguent pas la façon dont le symbole a été appelé : surcharges, formes d'arguments et options sont regroupées. Ce que fait une forme d'appel précise est prouvé par le contrat d'un échantillon, pas par ces nombres.
| Environnement | Confiance | Observations | Vérifié | Taux de réussite | Pairs | Dernière observation |
|---|---|---|---|---|---|---|
| node 22 · JS · npm · linux glibc · docker
Observations: PROJECT_TEST 1✓ — Vérifié: CONTRACT 1✓
|
LOW | 1 | 1 | 100 % | 1 · 1✓ | 2026-09-08 |
| node 22 · JS · npm · linux musl · docker
Vérifié: CONTRACT 1✓
|
LOW | 0 | 1 | 100 % | 0 · 1✓ | 2026-08-26 |
| node 22.23 · JS · npm · linux glibc
Observations: PROJECT_PROCESS 20✓ — Vérifié: UNKNOWN 0✓ 15✕
|
ELEVATED FAILURE | 20 | 15 | 57 % | 3 | 2026-08-30 |
snapshot · 2026-09-15
Clusters d'échecs
-
observé UNKNOWN exit 1 Lacune de preuve ×5 1.0.3 executionContext=node · moduleSystem=cjs · os=linux · runtime=node@22.23 sha256:91ad26545eb1…node:internal/modules/cjs/loader:<n> · throw err; · ^ · Error: Cannot find module <str>node · unclassified-diagnostic · outer node · gap stage-unknownQualité de preuve: complete · Variantes d’environnement: 1 · Premier relevé: 2026-08-30 · Dernière observation: 2026-08-31Candidat à une revérification diagnostique
-
observé UNKNOWN exit 1 ERR_MODULE_NOT_FOUND Lacune de preuve ×4 1.0.3 executionContext=node · moduleSystem=cjs · os=linux · runtime=node@22.23 sha256:88af852f99a8…node:internal/modules/package_json_reader:<n> · throw new ERR_MODULE_NOT_FOUND(packageName, fileURLToPath(base), null); · ^ …node · unclassified-diagnostic · outer node · gap stage-unknownQualité de preuve: complete · Variantes d’environnement: 1 · Premier relevé: 2026-08-29 · Dernière observation: 2026-08-30Candidat à une revérification diagnostique
-
observé UNKNOWN exit 1 Lacune de preuve ×1 1.0.3 executionContext=node · moduleSystem=cjs · os=linux · runtime=node@22.23 sha256:8310a83be884…node:internal/modules/cjs/loader:<n> · const err = new Error(message); · ^ · Error: Cannot find module <str>node · unclassified-diagnostic · outer node · gap stage-unknownQualité de preuve: complete · Variantes d’environnement: 1 · Premier relevé: 2026-08-29 · Dernière observation: 2026-08-29Candidat à une revérification diagnostique
-
observé UNKNOWN exit 1 Lacune de preuve ×1 1.0.3 executionContext=node · moduleSystem=cjs · os=linux · runtime=node@22.23 sha256:9922ca80f240…go: <path> already existsgo · unclassified-diagnostic · outer go mod · gap stage-unknownQualité de preuve: complete · Variantes d’environnement: 1 · Premier relevé: 2026-08-29 · Dernière observation: 2026-08-29Candidat à une revérification diagnostique
-
observé UNKNOWN exit 1 Lacune de preuve ×1 1.0.3 executionContext=node · moduleSystem=cjs · os=linux · runtime=node@22.23 sha256:f9f43a3adeb5…<path>:<n> · throw new TypeError(<str> + version) · ^ · TypeError: Invalid Version: invalidnode · unclassified-diagnostic · outer node · gap stage-unknownQualité de preuve: complete · Variantes d’environnement: 1 · Premier relevé: 2026-08-30 · Dernière observation: 2026-08-30Candidat à une revérification diagnostique
-
observé UNKNOWN exit 1 ERR_ASSERTION Lacune de preuve ×1 1.0.3 executionContext=node · moduleSystem=cjs · os=linux · runtime=node@22.23 sha256:07e974cf28d4…Test failed: AssertionError [ERR_ASSERTION]: getFeedURL should return configured feed url · + actual - expected · + <str> · - <str>node · unclassified-diagnostic · outer node · gap stage-unknownQualité de preuve: complete · Variantes d’environnement: 1 · Premier relevé: 2026-08-30 · Dernière observation: 2026-08-30Candidat à une revérification diagnostique
-
observé UNKNOWN exit 1 Lacune de preuve ×1 1.0.3 executionContext=node · moduleSystem=cjs · os=linux · runtime=node@22.23 sha256:1c03ca490615…Traceback (most recent call last): · File <str>, line 3, in <module> · AttributeError: module <str> has no attribute <str> · IANA_VERSION: <str>python · unclassified-diagnostic · outer python · gap stage-unknownQualité de preuve: complete · Variantes d’environnement: 1 · Premier relevé: 2026-08-30 · Dernière observation: 2026-08-30Candidat à une revérification diagnostique
-
observé UNKNOWN exit 1 Lacune de preuve ×1 1.0.3 executionContext=node · moduleSystem=cjs · os=linux · runtime=node@22.23 sha256:9be950af9140…Traceback (most recent call last): · File <str>, line 1, in <module> · ModuleNotFoundError: No module named <str>python3 · unclassified-diagnostic · outer python3 · gap stage-unknownQualité de preuve: complete · Variantes d’environnement: 1 · Premier relevé: 2026-08-30 · Dernière observation: 2026-08-30Candidat à une revérification diagnostique
-
observé UNKNOWN exit 1 Lacune de preuve ×1 1.0.3 executionContext=node · moduleSystem=cjs · os=linux · runtime=node@22.23 sha256:d296ed2b3573…Traceback (most recent call last): · File <str>, line 5, in <module> · ModuleNotFoundError: No module named <str> · IANA_VERSION: <str>python · unclassified-diagnostic · outer python · gap stage-unknownQualité de preuve: complete · Variantes d’environnement: 1 · Premier relevé: 2026-08-30 · Dernière observation: 2026-08-30Candidat à une revérification diagnostique
-
observé UNKNOWN exit 1 ERR_ASSERTION Lacune de preuve ×1 1.0.3 executionContext=node · moduleSystem=esm · os=linux · runtime=node@22.23 sha256:054c93088b95…node:internal/modules/run_main:<n> · triggerUncaughtException( · ^ …node · unclassified-diagnostic · outer node · gap stage-unknownQualité de preuve: complete · Variantes d’environnement: 1 · Premier relevé: 2026-08-31 · Dernière observation: 2026-08-31Candidat à une revérification diagnostique
-
observé UNKNOWN exit 1 ERR_ASSERTION Lacune de preuve ×1 1.0.3 executionContext=node · moduleSystem=cjs · os=linux · runtime=node@22.23 sha256:eb0938a47430…node:assert:<n> · throw new AssertionError(obj); · ^ · AssertionError [ERR_ASSERTION]: jest.getVersion() should return 29.6.3node · unclassified-diagnostic · outer node · gap stage-unknownQualité de preuve: complete · Variantes d’environnement: 1 · Premier relevé: 2026-08-31 · Dernière observation: 2026-08-31Candidat à une revérification diagnostique
-
observé UNKNOWN exit 1 ERR_ASSERTION Lacune de preuve ×1 1.0.3 executionContext=node · moduleSystem=cjs · os=linux · runtime=node@22.23 sha256:769e5b509341…node:internal/process/promises:<n> · triggerUncaughtException(err, true <path> fromPromise */); · ^ …node · unclassified-diagnostic · outer node · gap stage-unknownQualité de preuve: complete · Variantes d’environnement: 1 · Premier relevé: 2026-08-31 · Dernière observation: 2026-08-31Candidat à une revérification diagnostique
Affichage des 12 plus signalés parmi 14 groupes d’échecs enregistrés. Le reste sont des signalements uniques.