记录npmbrace-expansion2.1.7
环境详情
项目级观测与符号/契约验证分别统计,绝不合并。
这些计数不区分符号的调用方式:重载、参数形态和选项被合并统计。某一具体调用方式的行为由样本的契约证明,而不是由这些数字证明。
| 环境 | 置信度 | 观测 | 验证 | 通过率 | 节点 | 最近观测 |
|---|---|---|---|---|---|---|
| node 22 · JS · npm · linux glibc · docker
使用: USED 1✓
|
LOW | 0 +1 | 0 | — | 1 | 2026-10-17 |
| node 22 · JS · npm · linux glibc · docker
使用: USED 4✓
|
LOW | 0 +4 | 0 | — | 1 | 2026-10-21 |
| node 22 · JS · npm · linux glibc · docker
使用: USED 4✓
|
LOW | 0 +4 | 0 | — | 1 | 2026-10-21 |
| node 22.23 · JS · npm · linux glibc
观测: PROJECT_PROCESS 5✓ · PROJECT_TEST 2✓ — 使用: USED 9✓ — 验证: UNKNOWN 0✓ 4✕
|
ELEVATED FAILURE | 7 +9 | 4 | 64% | 1 | 2026-10-21 |
| node 22.23 · JS · npm · linux glibc
观测: PROJECT_PROCESS 20✓ · PROJECT_TEST 58✓ 7✕ — 使用: USED 81✓ — 验证: UNKNOWN 0✓ 10✕
|
LOW | 85 +81 | 10 | 82% | 1 | 2026-10-21 |
| node 24.13 · TS 5.9 · npm · windows
观测: PROJECT_COMPILE 1✓
|
LOW | 1 | 0 | 100% | 1 | 2026-09-17 |
| node 24.13 · TS · npm · windows
观测: PROJECT_COMPILE 7✓ · PROJECT_PROCESS 3✓ — 使用: USED 37✓ — 验证: UNKNOWN 0✓ 7✕
|
ELEVATED FAILURE | 10 +37 | 7 | 59% | 1 | 2026-10-20 |
近期失败聚类
-
已观测 UNKNOWN exit 1 ERR_ASSERTION 证据缺口 ×13 1.1.18 → 2.1.4 → 2.1.7 → 5.0.9 executionContext=node · os=linux · runtime=node@22.23 sha256:986d98189e70…node:internal/modules/run_main:<n> · triggerUncaughtException( · ^ · AssertionError [ERR_ASSERTION]: Expected values to be strictly equal:node · unclassified-diagnostic · outer node · gap stage-unknown证据质量: complete · 环境变体: 2 · 首次记录: 2026-08-29 · 最近观测: 2026-10-20诊断复验候选
-
已观测 UNKNOWN exit 1 ERR_ASSERTION 证据缺口 ×4 2.1.7 executionContext=node · os=linux · runtime=node@22.23 sha256:43caf7a060e7…node:internal/modules/run_main:<n> · triggerUncaughtException( · ^ · AssertionError [ERR_ASSERTION]: Expected values to be strictly deep-equal:node · unclassified-diagnostic · outer node · gap stage-unknown证据质量: complete · 环境变体: 2 · 首次记录: 2026-10-18 · 最近观测: 2026-10-21诊断复验候选
-
已观测 UNKNOWN exit 1 证据缺口 ×3 1.1.21 → 2.1.7 → 5.0.12 executionContext=node · moduleSystem=cjs · os=windows · runtime=node@24.13 sha256:2cb056298ab4…SELFTEST FAIL bounded-time · SELFTEST FAIL config-generation-keyframe-cut · dxgi replay ring self-test: FAIL · node:internal/errors:<n>npm · unclassified-diagnostic · outer npm run · gap stage-unknown证据质量: complete · 环境变体: 1 · 首次记录: 2026-09-16 · 最近观测: 2026-09-16诊断复验候选
-
已观测 UNKNOWN exit 1 证据缺口 ×3 1.1.21 → 2.1.7 → 5.0.12 executionContext=node · moduleSystem=cjs · os=windows · runtime=node@24.13 sha256:819cb89d1c79…<url> · throw new Error( · ^ · Error: DXGI replay native self-test markers changed or were incomplete:npm · unclassified-diagnostic · outer npm run · gap stage-unknown证据质量: complete · 环境变体: 1 · 首次记录: 2026-09-16 · 最近观测: 2026-09-16诊断复验候选
-
已观测 UNKNOWN exit 1 证据缺口 ×3 1.1.21 → 2.1.7 → 5.0.12 executionContext=node · moduleSystem=cjs · os=windows · runtime=node@24.13 sha256:86e62e0f88c9…SELFTEST FAIL retention-export-window-anchors-to-latest-encoded-sample · dxgi replay ring self-test: FAIL · node:internal/errors:<n> …npm · unclassified-diagnostic · outer npm run · gap stage-unknown证据质量: complete · 环境变体: 1 · 首次记录: 2026-09-16 · 最近观测: 2026-09-16诊断复验候选
-
已观测 UNKNOWN exit 1 证据缺口 ×3 1.1.21 → 2.1.7 → 5.0.12 executionContext=node · moduleSystem=cjs · os=windows · runtime=node@24.13 sha256:92afbc39da22…<url> · throw new Error( · ^ · Error: dxgi-replay-ring.exe compile failed (2): dxgi-replay-ring.cppnpm · unclassified-diagnostic · outer npm run · gap stage-unknown证据质量: complete · 环境变体: 1 · 首次记录: 2026-09-16 · 最近观测: 2026-09-16诊断复验候选
-
已观测 UNKNOWN exit 1 证据缺口 ×3 1.1.21 → 2.1.7 → 5.0.12 executionContext=node · moduleSystem=cjs · os=windows · runtime=node@24.13 sha256:a0a8ceaaf237…> capturepack@0.5.1 check:site · > node <path> · Landing translations · PASS en: 42 rendered stringsnpm · unclassified-diagnostic · outer npm run · gap stage-unknown证据质量: complete · 环境变体: 1 · 首次记录: 2026-09-16 · 最近观测: 2026-09-16诊断复验候选
-
已观测 UNKNOWN exit 1 证据缺口 ×3 1.1.21 → 2.1.7 → 5.0.12 executionContext=node · moduleSystem=cjs · os=windows · runtime=node@24.13 sha256:aa33afc48c64…...ppData\Local\Temp\capturepack-dxgi-runtime-check-Rt8eb9\check.cjs 95.9kb · Done in 11ms · dxgi replay integration check: 1 failed …npm · unclassified-diagnostic · outer npm run · gap stage-unknown证据质量: complete · 环境变体: 1 · 首次记录: 2026-09-16 · 最近观测: 2026-09-16诊断复验候选
-
已观测 UNKNOWN exit 1 EPERM 证据缺口 ×3 1.1.21 → 2.1.7 → 5.0.12 executionContext=node · moduleSystem=cjs · os=windows · runtime=node@24.13 sha256:b40ca5d413e3…node:internal/modules/run_main:<n> · triggerUncaughtException( · ^ · [Error: EPERM: operation not permitted, unlink <str>] {npm · unclassified-diagnostic · outer npm run · gap stage-unknown证据质量: complete · 环境变体: 1 · 首次记录: 2026-09-16 · 最近观测: 2026-09-16诊断复验候选
-
已观测 UNKNOWN exit 1 证据缺口 ×2 2.1.7 executionContext=node · moduleSystem=esm · os=linux · runtime=node@22.23 sha256:536db39a2e08…<path>:<n> · const closeError = new Error(<str>) · ^ · Error: command failednpm · unclassified-diagnostic · outer npm test · gap stage-unknown证据质量: complete · 环境变体: 1 · 首次记录: 2026-10-18 · 最近观测: 2026-10-18诊断复验候选
-
已观测 UNKNOWN exit 1 ERR_ASSERTION 证据缺口 ×2 2.1.7 executionContext=node · moduleSystem=esm · os=linux · runtime=node@22.23 sha256:8be05b42c85b…node:internal/modules/run_main:<n> · triggerUncaughtException( · ^ · AssertionError [ERR_ASSERTION]: Root metadata should roundtrip through JSONnode · unclassified-diagnostic · outer node · gap stage-unknown证据质量: complete · 环境变体: 1 · 首次记录: 2026-10-18 · 最近观测: 2026-10-18诊断复验候选
-
已观测 PROJECT_TEST exit 1 ERR_ASSERTION ×2 2.1.7 executionContext=node · moduleSystem=esm · os=linux · runtime=node@22.23 sha256:4904e63e5296…AssertionError [ERR_ASSERTION]: Expected values to be strictly equal: · + actual - expected · + <str> · - <str>javascript/test-runner · test-runner-diagnostic · outer npm test证据质量: complete · 环境变体: 1 · 首次记录: 2026-10-18 · 最近观测: 2026-10-20
显示报告最多的 12 个。此坐标记录的失败聚类共 21 个。其余为单次报告。
符号
暂无带证据的符号。