Registrosnpmbrace-expansion2.1.7
Detalhe do ambiente
Observações no nível do projeto e verificações de símbolo/contrato são contadas separadamente e nunca somadas.
Estas contagens não distinguem como o símbolo foi chamado: sobrecargas, formatos de argumentos e opções são agrupados. O que uma forma de chamada específica faz é provado pelo contrato de uma amostra, não por estes números.
| Ambiente | Confiança | Observações | Verificado | Taxa de aprovação | Peers | Visto por último |
|---|---|---|---|---|---|---|
| node 22 · JS · npm · linux glibc · docker
Uso: USED 1✓
|
LOW | 0 +1 | 0 | — | 1 | 2026-10-17 |
| node 22 · JS · npm · linux glibc · docker
Uso: USED 4✓
|
LOW | 0 +4 | 0 | — | 1 | 2026-10-21 |
| node 22 · JS · npm · linux glibc · docker
Uso: USED 4✓
|
LOW | 0 +4 | 0 | — | 1 | 2026-10-21 |
| node 22.23 · JS · npm · linux glibc
Observações: PROJECT_PROCESS 5✓ · PROJECT_TEST 2✓ — Uso: USED 9✓ — Verificado: UNKNOWN 0✓ 4✕
|
ELEVATED FAILURE | 7 +9 | 4 | 64% | 1 | 2026-10-21 |
| node 22.23 · JS · npm · linux glibc
Observações: PROJECT_PROCESS 20✓ · PROJECT_TEST 58✓ 7✕ — Uso: USED 81✓ — Verificado: UNKNOWN 0✓ 10✕
|
LOW | 85 +81 | 10 | 82% | 1 | 2026-10-21 |
| node 24.13 · TS 5.9 · npm · windows
Observações: PROJECT_COMPILE 1✓
|
LOW | 1 | 0 | 100% | 1 | 2026-09-17 |
| node 24.13 · TS · npm · windows
Observações: PROJECT_COMPILE 7✓ · PROJECT_PROCESS 3✓ — Uso: USED 37✓ — Verificado: UNKNOWN 0✓ 7✕
|
ELEVATED FAILURE | 10 +37 | 7 | 59% | 1 | 2026-10-20 |
Clusters de falha recentes
-
observado UNKNOWN exit 1 ERR_ASSERTION Lacuna de evidência ×13 1.1.18 → 2.1.4 → 2.1.7 → 5.0.9 executionContext=node · os=linux · runtime=node@22.23 sha256:986d98189e70…node:internal/modules/run_main:<n> · triggerUncaughtException( · ^ · AssertionError [ERR_ASSERTION]: Expected values to be strictly equal:node · unclassified-diagnostic · outer node · gap stage-unknownQualidade da evidência: complete · Variantes de ambiente: 2 · Primeiro registro: 2026-08-29 · Visto por último: 2026-10-20Candidato a reverificação diagnóstica
-
observado UNKNOWN exit 1 ERR_ASSERTION Lacuna de evidência ×4 2.1.7 executionContext=node · os=linux · runtime=node@22.23 sha256:43caf7a060e7…node:internal/modules/run_main:<n> · triggerUncaughtException( · ^ · AssertionError [ERR_ASSERTION]: Expected values to be strictly deep-equal:node · unclassified-diagnostic · outer node · gap stage-unknownQualidade da evidência: complete · Variantes de ambiente: 2 · Primeiro registro: 2026-10-18 · Visto por último: 2026-10-21Candidato a reverificação diagnóstica
-
observado UNKNOWN exit 1 Lacuna de evidência ×3 1.1.21 → 2.1.7 → 5.0.12 executionContext=node · moduleSystem=cjs · os=windows · runtime=node@24.13 sha256:2cb056298ab4…SELFTEST FAIL bounded-time · SELFTEST FAIL config-generation-keyframe-cut · dxgi replay ring self-test: FAIL · node:internal/errors:<n>npm · unclassified-diagnostic · outer npm run · gap stage-unknownQualidade da evidência: complete · Variantes de ambiente: 1 · Primeiro registro: 2026-09-16 · Visto por último: 2026-09-16Candidato a reverificação diagnóstica
-
observado UNKNOWN exit 1 Lacuna de evidência ×3 1.1.21 → 2.1.7 → 5.0.12 executionContext=node · moduleSystem=cjs · os=windows · runtime=node@24.13 sha256:819cb89d1c79…<url> · throw new Error( · ^ · Error: DXGI replay native self-test markers changed or were incomplete:npm · unclassified-diagnostic · outer npm run · gap stage-unknownQualidade da evidência: complete · Variantes de ambiente: 1 · Primeiro registro: 2026-09-16 · Visto por último: 2026-09-16Candidato a reverificação diagnóstica
-
observado UNKNOWN exit 1 Lacuna de evidência ×3 1.1.21 → 2.1.7 → 5.0.12 executionContext=node · moduleSystem=cjs · os=windows · runtime=node@24.13 sha256:86e62e0f88c9…SELFTEST FAIL retention-export-window-anchors-to-latest-encoded-sample · dxgi replay ring self-test: FAIL · node:internal/errors:<n> …npm · unclassified-diagnostic · outer npm run · gap stage-unknownQualidade da evidência: complete · Variantes de ambiente: 1 · Primeiro registro: 2026-09-16 · Visto por último: 2026-09-16Candidato a reverificação diagnóstica
-
observado UNKNOWN exit 1 Lacuna de evidência ×3 1.1.21 → 2.1.7 → 5.0.12 executionContext=node · moduleSystem=cjs · os=windows · runtime=node@24.13 sha256:92afbc39da22…<url> · throw new Error( · ^ · Error: dxgi-replay-ring.exe compile failed (2): dxgi-replay-ring.cppnpm · unclassified-diagnostic · outer npm run · gap stage-unknownQualidade da evidência: complete · Variantes de ambiente: 1 · Primeiro registro: 2026-09-16 · Visto por último: 2026-09-16Candidato a reverificação diagnóstica
-
observado UNKNOWN exit 1 Lacuna de evidência ×3 1.1.21 → 2.1.7 → 5.0.12 executionContext=node · moduleSystem=cjs · os=windows · runtime=node@24.13 sha256:a0a8ceaaf237…> capturepack@0.5.1 check:site · > node <path> · Landing translations · PASS en: 42 rendered stringsnpm · unclassified-diagnostic · outer npm run · gap stage-unknownQualidade da evidência: complete · Variantes de ambiente: 1 · Primeiro registro: 2026-09-16 · Visto por último: 2026-09-16Candidato a reverificação diagnóstica
-
observado UNKNOWN exit 1 Lacuna de evidência ×3 1.1.21 → 2.1.7 → 5.0.12 executionContext=node · moduleSystem=cjs · os=windows · runtime=node@24.13 sha256:aa33afc48c64…...ppData\Local\Temp\capturepack-dxgi-runtime-check-Rt8eb9\check.cjs 95.9kb · Done in 11ms · dxgi replay integration check: 1 failed …npm · unclassified-diagnostic · outer npm run · gap stage-unknownQualidade da evidência: complete · Variantes de ambiente: 1 · Primeiro registro: 2026-09-16 · Visto por último: 2026-09-16Candidato a reverificação diagnóstica
-
observado UNKNOWN exit 1 EPERM Lacuna de evidência ×3 1.1.21 → 2.1.7 → 5.0.12 executionContext=node · moduleSystem=cjs · os=windows · runtime=node@24.13 sha256:b40ca5d413e3…node:internal/modules/run_main:<n> · triggerUncaughtException( · ^ · [Error: EPERM: operation not permitted, unlink <str>] {npm · unclassified-diagnostic · outer npm run · gap stage-unknownQualidade da evidência: complete · Variantes de ambiente: 1 · Primeiro registro: 2026-09-16 · Visto por último: 2026-09-16Candidato a reverificação diagnóstica
-
observado UNKNOWN exit 1 Lacuna de evidência ×2 2.1.7 executionContext=node · moduleSystem=esm · os=linux · runtime=node@22.23 sha256:536db39a2e08…<path>:<n> · const closeError = new Error(<str>) · ^ · Error: command failednpm · unclassified-diagnostic · outer npm test · gap stage-unknownQualidade da evidência: complete · Variantes de ambiente: 1 · Primeiro registro: 2026-10-18 · Visto por último: 2026-10-18Candidato a reverificação diagnóstica
-
observado UNKNOWN exit 1 ERR_ASSERTION Lacuna de evidência ×2 2.1.7 executionContext=node · moduleSystem=esm · os=linux · runtime=node@22.23 sha256:8be05b42c85b…node:internal/modules/run_main:<n> · triggerUncaughtException( · ^ · AssertionError [ERR_ASSERTION]: Root metadata should roundtrip through JSONnode · unclassified-diagnostic · outer node · gap stage-unknownQualidade da evidência: complete · Variantes de ambiente: 1 · Primeiro registro: 2026-10-18 · Visto por último: 2026-10-18Candidato a reverificação diagnóstica
-
observado PROJECT_TEST exit 1 ERR_ASSERTION ×2 2.1.7 executionContext=node · moduleSystem=esm · os=linux · runtime=node@22.23 sha256:4904e63e5296…AssertionError [ERR_ASSERTION]: Expected values to be strictly equal: · + actual - expected · + <str> · - <str>javascript/test-runner · test-runner-diagnostic · outer npm testQualidade da evidência: complete · Variantes de ambiente: 1 · Primeiro registro: 2026-10-18 · Visto por último: 2026-10-20
Mostrando os 12 mais relatados de 21 grupos de falhas registrados. O resto são relatos únicos.
Símbolos
Ainda não há símbolos com evidências.