기록golanggithub.com/go-logfmt/logfmtv0.6.0NewEncoder
OS × 런타임 한눈에 보기
1 12026-09-02
셀 읽는 법: 숫자는 비율이 딛고 선 기록된 관측 수입니다 — 한 번의 빌드가 도달한 단계마다 관측이 하나씩 남으므로, 빌드 수도 머신 수도 사람 수도 아닙니다. 옆의 문서는 출처가 다른 별개의 사실입니다: 그 좌표에 샘플이 있는지, 그리고 우리가 거기서 실행한 결과가 어떻는지입니다.
- 이 좌표에는 아직 샘플이 없음
- 샘플 있음 — 이 좌표에서는 아직 우리가 실행하지 않음
- 샘플 있음 — 이 좌표에서 우리가 실행했고 통과함
- 샘플 있음 — 이 좌표에서 우리가 실행했고 실패함
- 샘플 있음 — 이 좌표에 통과와 실패가 모두 기록됨
- 기록 없음 — 알 수 없음이지 "된다"도 "안 된다"도 아님
- 이 셀 아래에 단계가 더 있음 — 클릭하면 열림
문서가 있으면 그 좌표에 샘플이 있다는 뜻입니다. 샘플이 존재하는지는 이 버전과 이 API에 대한 사실이라 OS·런타임·패키지 매니저가 바뀌어도 달라지지 않고, 문서의 색은 지금 보고 있는 환경에서 그 샘플이 어떻게 실행됐는지를 말합니다.
공개한 샘플
- github.com/go-logfmt/logfmt v0.6.0: Encode and decode logfmt formatted key-value pairs 이 네트워크가 제공하는 것은 하나입니다. 빌드되는 샘플. 샌드박스에서 돌리고 서명된 영수증을 보관합니다. 등급을 매기지 않고 무엇도 보증하지 않습니다 — 같은 코드가 당신 환경에서 빌드되는지는 측정한 적이 없습니다. HOWDecoder.ScanRecordEncoder.EncodeKeyvalNewDecoderNewEncodergo 1.26 MIT-0 · 2026-08-23
- github.com/go-logfmt/logfmt v0.6.0: NewEncoder 이 네트워크가 제공하는 것은 하나입니다. 빌드되는 샘플. 샌드박스에서 돌리고 서명된 영수증을 보관합니다. 등급을 매기지 않고 무엇도 보증하지 않습니다 — 같은 코드가 당신 환경에서 빌드되는지는 측정한 적이 없습니다. HOWgithub.com/go-logfmt/logfmt.NewEncoder MIT-0 · 2026-08-23
- github.com/go-logfmt/logfmt v0.6.0: NewEncoder 이 네트워크가 제공하는 것은 하나입니다. 빌드되는 샘플. 샌드박스에서 돌리고 서명된 영수증을 보관합니다. 등급을 매기지 않고 무엇도 보증하지 않습니다 — 같은 코드가 당신 환경에서 빌드되는지는 측정한 적이 없습니다. HOWlogfmt.NewEncodergo 1.26.6 MIT-0 · 2026-09-02
호환성 매트릭스
프로젝트 수준 관측과 심벌/컨트랙트 검증은 따로 집계하며 절대 합산하지 않습니다.
이 수치는 심볼을 어떻게 호출했는지 구분하지 않습니다. 오버로드, 인자 형태, 옵션이 한데 묶여 집계됩니다. 특정 호출 형태가 어떻게 동작하는지는 이 숫자가 아니라 샘플의 계약이 증명합니다.
| 환경 | 신뢰도 | 관측 | 검증 | 통과율 | 피어 | 마지막 관측 |
|---|---|---|---|---|---|---|
| go 1.26 · Go · go · linux glibc
관측: PROJECT_PROCESS 7✓ 3✕ · PROJECT_TEST 1✓ — 검증: UNKNOWN 0✓ 4✕
|
ELEVATED FAILURE | 11 | 4 | 53% | 1 | 2026-09-02 |
| go 1.26 · Go · go · linux musl · docker
검증: CONTRACT 1✓
|
LOW | 0 | 1 | 100% | 0 · 1✓ | 2026-08-23 |
snapshot · 2026-09-15
실패 클러스터
-
관측됨 PROJECT_PROCESS 증거 공백 ×3 v0.6.0 os=linux · runtime=go@1.26증거 품질: legacy-evidence-incomplete · 환경 변형: 1 · 최초 관측: 2026-08-26 · 마지막 관측: 2026-08-26진단 재검증 후보
-
관측됨 PROJECT_COMPILE exit 1 ×2 v0.6.0 os=linux · runtime=go@1.26 sha256:964ddac6b19a…<path> <str> imported and not usedgo/compiler · compiler-diagnostic · outer go test증거 품질: complete · 환경 변형: 1 · 최초 관측: 2026-09-02 · 마지막 관측: 2026-09-02
-
관측됨 PROJECT_TEST exit 1 ×2 v0.6.0 os=linux · runtime=go@1.26 sha256:aff26ae99c2f…--- FAIL: TestMarshalKeyvalsContract (0.00s) · FAIL example.com/sample 0.003sgo/test · test-runner-diagnostic · outer go test증거 품질: complete · 환경 변형: 1 · 최초 관측: 2026-09-02 · 마지막 관측: 2026-09-02
-
관측됨 UNKNOWN exit 1 증거 공백 ×2 v0.6.0 os=linux · runtime=go@1.26 sha256:3b3190f2cd44…doc: cannot find package <str> in any of: · ($GOROOT not set) · <path> (from $GOPATH)go · unclassified-diagnostic · outer go · gap stage-unknown증거 품질: complete · 환경 변형: 1 · 최초 관측: 2026-09-02 · 마지막 관측: 2026-09-02진단 재검증 후보
-
관측됨 UNKNOWN exit 1 증거 공백 ×2 v0.6.0 os=linux · runtime=go@1.26 sha256:b5ab77f14125…doc: no symbol UnmarshalKeyvals in package pkg/mod/github.com/go-logfmt/logfmt@v0.6.0go · unclassified-diagnostic · outer go · gap stage-unknown증거 품질: complete · 환경 변형: 1 · 최초 관측: 2026-09-02 · 마지막 관측: 2026-09-02진단 재검증 후보
-
관측됨 UNKNOWN exit 1 증거 공백 ×1 v0.6.0 os=linux · runtime=go@1.26 sha256:6ed4679e28a1…expected logfmt.ErrUnsupportedKeyType for int key, got <nil> · exit status 1go · unclassified-diagnostic · outer go run · gap stage-unknown증거 품질: complete · 환경 변형: 1 · 최초 관측: 2026-08-31 · 마지막 관측: 2026-08-31진단 재검증 후보
-
관측됨 UNKNOWN exit 1 증거 공백 ×1 v0.6.0 os=linux · runtime=go@1.26 sha256:7d69c4f6d69b…assertion 5 failed: expected ErrInvalidKey, got <nil> · exit status 1go · unclassified-diagnostic · outer go run · gap stage-unknown증거 품질: complete · 환경 변형: 1 · 최초 관측: 2026-08-31 · 마지막 관측: 2026-08-31진단 재검증 후보
-
관측됨 UNKNOWN exit 1 증거 공백 ×1 v0.6.0 os=linux · runtime=go@1.26 sha256:7e1230015d91…expected logfmt.ErrInvalidKey for key with <str>, got <nil> · exit status 1go · unclassified-diagnostic · outer go run · gap stage-unknown증거 품질: complete · 환경 변형: 1 · 최초 관측: 2026-08-31 · 마지막 관측: 2026-08-31진단 재검증 후보
-
관측됨 PROJECT_COMPILE exit 1 ×1 v0.6.0 os=linux · runtime=go@1.26 sha256:bc86267941b4…<path> undefined: logfmt.ErrMissingValuego/compiler · compiler-diagnostic · outer go test증거 품질: complete · 환경 변형: 1 · 최초 관측: 2026-09-02 · 마지막 관측: 2026-09-02
-
관측됨 PROJECT_TEST exit 1 ×1 v0.6.0 os=linux · runtime=go@1.26 sha256:2681fa3ac3d6…--- FAIL: TestContractMarshalKeyvals (0.00s) · FAIL example.com/sample 0.003sgo/test · test-runner-diagnostic · outer go test증거 품질: complete · 환경 변형: 1 · 최초 관측: 2026-09-02 · 마지막 관측: 2026-09-02
-
관측됨 UNKNOWN exit 1 증거 공백 ×1 v0.6.0 os=linux · runtime=go@1.26 sha256:88cc5cb04e23…expected ErrInvalidKey for space in key, got <nil> · exit status 1go · unclassified-diagnostic · outer go run · gap stage-unknown증거 품질: complete · 환경 변형: 1 · 최초 관측: 2026-09-02 · 마지막 관측: 2026-09-02진단 재검증 후보
-
관측됨 UNKNOWN exit 1 증거 공백 ×1 v0.6.0 os=linux · runtime=go@1.26 sha256:97356d0a60a7…expected empty string quoted in output, got <str>he said \\\<str>\<str>line1\\nline2\<str> · exit status 1go · unclassified-diagnostic · outer go run · gap stage-unknown증거 품질: complete · 환경 변형: 1 · 최초 관측: 2026-09-02 · 마지막 관측: 2026-09-02진단 재검증 후보