記録golanggithub.com/go-logfmt/logfmtv0.6.0NewEncoder
OS × ランタイムを一目で
1 12026-09-02
セルの読み方: 数字は割合が依拠する記録済み観測の数です — 1 回のビルドは到達した段階ごとに観測を 1 件残すため、ビルド数でもマシン数でも人数でもありません。隣の文書は出所の異なる別の事実です。その座標にサンプルがあるか、そして私たちがそこで実行した結果がどうだったかです。
- この座標にはまだサンプルがない
- サンプルあり — この座標ではまだ実行していない
- サンプルあり — この座標で実行し、問題なく終わった
- サンプルあり — この座標で実行し、失敗した
- サンプルあり — この座標には成功した実行と失敗した実行の両方が記録されている
- 記録なし — 不明であって「動く」でも「壊れている」でもない
- このセルの下にまだ段階がある — クリックで開く
文書があれば、その座標にサンプルがあるということです。サンプルが存在するかどうかはこのリリースとこの API についての事実で、OS・ランタイム・パッケージマネージャが変わっても変わりません。色は、今見ている環境でそのサンプルがどう実行されたかを示します。
公開したサンプル
- github.com/go-logfmt/logfmt v0.6.0: Encode and decode logfmt formatted key-value pairs このネットワークが提供するのは一つだけです。ビルドされるサンプル。サンドボックスで実行し、署名済みの受領証を保管します。等級はつけず、何も保証しません — 同じコードがあなたの環境でビルドされるかは測定していません。 HOWDecoder.ScanRecordEncoder.EncodeKeyvalNewDecoderNewEncodergo 1.26 MIT-0 · 2026-08-23
- github.com/go-logfmt/logfmt v0.6.0: NewEncoder このネットワークが提供するのは一つだけです。ビルドされるサンプル。サンドボックスで実行し、署名済みの受領証を保管します。等級はつけず、何も保証しません — 同じコードがあなたの環境でビルドされるかは測定していません。 HOWgithub.com/go-logfmt/logfmt.NewEncoder MIT-0 · 2026-08-23
- github.com/go-logfmt/logfmt v0.6.0: NewEncoder このネットワークが提供するのは一つだけです。ビルドされるサンプル。サンドボックスで実行し、署名済みの受領証を保管します。等級はつけず、何も保証しません — 同じコードがあなたの環境でビルドされるかは測定していません。 HOWlogfmt.NewEncodergo 1.26.6 MIT-0 · 2026-09-02
互換性マトリクス
プロジェクトレベルの観測とシンボル/コントラクト検証は別々に集計し、決して合算しません。
これらの数値は、シンボルがどう呼び出されたかを区別しません。オーバーロード、引数の形、オプションはまとめて集計されます。特定の呼び出し方がどう動くかは、この数値ではなくサンプルの契約が証明します。
| 環境 | 信頼度 | 観測 | 検証 | 成功率 | ピア | 最終観測 |
|---|---|---|---|---|---|---|
| go 1.26 · Go · go · linux glibc
観測: PROJECT_PROCESS 7✓ 3✕ · PROJECT_TEST 1✓ — 検証: UNKNOWN 0✓ 4✕
|
ELEVATED FAILURE | 11 | 4 | 53% | 1 | 2026-09-02 |
| go 1.26 · Go · go · linux musl · docker
検証: CONTRACT 1✓
|
LOW | 0 | 1 | 100% | 0 · 1✓ | 2026-08-23 |
snapshot · 2026-09-15
失敗クラスター
-
観測済み PROJECT_PROCESS 証拠の欠落 ×3 v0.6.0 os=linux · runtime=go@1.26証拠品質: legacy-evidence-incomplete · 環境バリアント: 1 · 初回記録: 2026-08-26 · 最終観測: 2026-08-26診断再検証候補
-
観測済み PROJECT_COMPILE exit 1 ×2 v0.6.0 os=linux · runtime=go@1.26 sha256:964ddac6b19a…<path> <str> imported and not usedgo/compiler · compiler-diagnostic · outer go test証拠品質: complete · 環境バリアント: 1 · 初回記録: 2026-09-02 · 最終観測: 2026-09-02
-
観測済み PROJECT_TEST exit 1 ×2 v0.6.0 os=linux · runtime=go@1.26 sha256:aff26ae99c2f…--- FAIL: TestMarshalKeyvalsContract (0.00s) · FAIL example.com/sample 0.003sgo/test · test-runner-diagnostic · outer go test証拠品質: complete · 環境バリアント: 1 · 初回記録: 2026-09-02 · 最終観測: 2026-09-02
-
観測済み UNKNOWN exit 1 証拠の欠落 ×2 v0.6.0 os=linux · runtime=go@1.26 sha256:3b3190f2cd44…doc: cannot find package <str> in any of: · ($GOROOT not set) · <path> (from $GOPATH)go · unclassified-diagnostic · outer go · gap stage-unknown証拠品質: complete · 環境バリアント: 1 · 初回記録: 2026-09-02 · 最終観測: 2026-09-02診断再検証候補
-
観測済み UNKNOWN exit 1 証拠の欠落 ×2 v0.6.0 os=linux · runtime=go@1.26 sha256:b5ab77f14125…doc: no symbol UnmarshalKeyvals in package pkg/mod/github.com/go-logfmt/logfmt@v0.6.0go · unclassified-diagnostic · outer go · gap stage-unknown証拠品質: complete · 環境バリアント: 1 · 初回記録: 2026-09-02 · 最終観測: 2026-09-02診断再検証候補
-
観測済み UNKNOWN exit 1 証拠の欠落 ×1 v0.6.0 os=linux · runtime=go@1.26 sha256:6ed4679e28a1…expected logfmt.ErrUnsupportedKeyType for int key, got <nil> · exit status 1go · unclassified-diagnostic · outer go run · gap stage-unknown証拠品質: complete · 環境バリアント: 1 · 初回記録: 2026-08-31 · 最終観測: 2026-08-31診断再検証候補
-
観測済み UNKNOWN exit 1 証拠の欠落 ×1 v0.6.0 os=linux · runtime=go@1.26 sha256:7d69c4f6d69b…assertion 5 failed: expected ErrInvalidKey, got <nil> · exit status 1go · unclassified-diagnostic · outer go run · gap stage-unknown証拠品質: complete · 環境バリアント: 1 · 初回記録: 2026-08-31 · 最終観測: 2026-08-31診断再検証候補
-
観測済み UNKNOWN exit 1 証拠の欠落 ×1 v0.6.0 os=linux · runtime=go@1.26 sha256:7e1230015d91…expected logfmt.ErrInvalidKey for key with <str>, got <nil> · exit status 1go · unclassified-diagnostic · outer go run · gap stage-unknown証拠品質: complete · 環境バリアント: 1 · 初回記録: 2026-08-31 · 最終観測: 2026-08-31診断再検証候補
-
観測済み PROJECT_COMPILE exit 1 ×1 v0.6.0 os=linux · runtime=go@1.26 sha256:bc86267941b4…<path> undefined: logfmt.ErrMissingValuego/compiler · compiler-diagnostic · outer go test証拠品質: complete · 環境バリアント: 1 · 初回記録: 2026-09-02 · 最終観測: 2026-09-02
-
観測済み PROJECT_TEST exit 1 ×1 v0.6.0 os=linux · runtime=go@1.26 sha256:2681fa3ac3d6…--- FAIL: TestContractMarshalKeyvals (0.00s) · FAIL example.com/sample 0.003sgo/test · test-runner-diagnostic · outer go test証拠品質: complete · 環境バリアント: 1 · 初回記録: 2026-09-02 · 最終観測: 2026-09-02
-
観測済み UNKNOWN exit 1 証拠の欠落 ×1 v0.6.0 os=linux · runtime=go@1.26 sha256:88cc5cb04e23…expected ErrInvalidKey for space in key, got <nil> · exit status 1go · unclassified-diagnostic · outer go run · gap stage-unknown証拠品質: complete · 環境バリアント: 1 · 初回記録: 2026-09-02 · 最終観測: 2026-09-02診断再検証候補
-
観測済み UNKNOWN exit 1 証拠の欠落 ×1 v0.6.0 os=linux · runtime=go@1.26 sha256:97356d0a60a7…expected empty string quoted in output, got <str>he said \\\<str>\<str>line1\\nline2\<str> · exit status 1go · unclassified-diagnostic · outer go run · gap stage-unknown証拠品質: complete · 環境バリアント: 1 · 初回記録: 2026-09-02 · 最終観測: 2026-09-02診断再検証候補