记录golanggithub.com/go-logfmt/logfmtv0.6.0NewEncoder
OS × 运行时一览
1 12026-09-02
如何阅读单元格: 数字是该比率所依据的已记录观测次数——一次构建每到达一个阶段就留下一条观测,因此它既不是构建数,也不是机器数或人数。旁边的文档是另一个来源不同的事实:该坐标是否有样例,以及我们在那里运行它的结果。
- 该坐标还没有样例
- 有样例 — 我们尚未在该坐标运行过它
- 有样例 — 我们在该坐标运行过,并且干净地结束
- 有样例 — 我们在该坐标运行过,并且失败了
- 有样例 — 该坐标同时记录了通过的和失败的运行
- 没有记录 — 未知,既非“可用”也非“损坏”
- 这一格下面还有层级 — 点击打开
有文档,就说明该坐标有样例。样例是否存在,是关于这个版本和这个 API 的事实,不随操作系统、运行时或包管理器改变;颜色说的是它在你正在看的那个环境里跑得怎么样。
已发布的示例
- github.com/go-logfmt/logfmt v0.6.0: Encode and decode logfmt formatted key-value pairs 本网络只提供一件事:能构建的样本。它在沙箱中运行并保留签名回执。它不评级、不担保——同样的代码能否在你的环境构建,它没有测量过。 HOWDecoder.ScanRecordEncoder.EncodeKeyvalNewDecoderNewEncodergo 1.26 MIT-0 · 2026-08-23
- github.com/go-logfmt/logfmt v0.6.0: NewEncoder 本网络只提供一件事:能构建的样本。它在沙箱中运行并保留签名回执。它不评级、不担保——同样的代码能否在你的环境构建,它没有测量过。 HOWgithub.com/go-logfmt/logfmt.NewEncoder MIT-0 · 2026-08-23
- github.com/go-logfmt/logfmt v0.6.0: NewEncoder 本网络只提供一件事:能构建的样本。它在沙箱中运行并保留签名回执。它不评级、不担保——同样的代码能否在你的环境构建,它没有测量过。 HOWlogfmt.NewEncodergo 1.26.6 MIT-0 · 2026-09-02
兼容性矩阵
项目级观测与符号/契约验证分别统计,绝不合并。
这些计数不区分符号的调用方式:重载、参数形态和选项被合并统计。某一具体调用方式的行为由样本的契约证明,而不是由这些数字证明。
| 环境 | 置信度 | 观测 | 验证 | 通过率 | 节点 | 最近观测 |
|---|---|---|---|---|---|---|
| go 1.26 · Go · go · linux glibc
观测: PROJECT_PROCESS 7✓ 3✕ · PROJECT_TEST 1✓ — 验证: UNKNOWN 0✓ 4✕
|
ELEVATED FAILURE | 11 | 4 | 53% | 1 | 2026-09-02 |
| go 1.26 · Go · go · linux musl · docker
验证: CONTRACT 1✓
|
LOW | 0 | 1 | 100% | 0 · 1✓ | 2026-08-23 |
snapshot · 2026-09-15
失败聚类
-
已观测 PROJECT_PROCESS 证据缺口 ×3 v0.6.0 os=linux · runtime=go@1.26证据质量: legacy-evidence-incomplete · 环境变体: 1 · 首次记录: 2026-08-26 · 最近观测: 2026-08-26诊断复验候选
-
已观测 PROJECT_COMPILE exit 1 ×2 v0.6.0 os=linux · runtime=go@1.26 sha256:964ddac6b19a…<path> <str> imported and not usedgo/compiler · compiler-diagnostic · outer go test证据质量: complete · 环境变体: 1 · 首次记录: 2026-09-02 · 最近观测: 2026-09-02
-
已观测 PROJECT_TEST exit 1 ×2 v0.6.0 os=linux · runtime=go@1.26 sha256:aff26ae99c2f…--- FAIL: TestMarshalKeyvalsContract (0.00s) · FAIL example.com/sample 0.003sgo/test · test-runner-diagnostic · outer go test证据质量: complete · 环境变体: 1 · 首次记录: 2026-09-02 · 最近观测: 2026-09-02
-
已观测 UNKNOWN exit 1 证据缺口 ×2 v0.6.0 os=linux · runtime=go@1.26 sha256:3b3190f2cd44…doc: cannot find package <str> in any of: · ($GOROOT not set) · <path> (from $GOPATH)go · unclassified-diagnostic · outer go · gap stage-unknown证据质量: complete · 环境变体: 1 · 首次记录: 2026-09-02 · 最近观测: 2026-09-02诊断复验候选
-
已观测 UNKNOWN exit 1 证据缺口 ×2 v0.6.0 os=linux · runtime=go@1.26 sha256:b5ab77f14125…doc: no symbol UnmarshalKeyvals in package pkg/mod/github.com/go-logfmt/logfmt@v0.6.0go · unclassified-diagnostic · outer go · gap stage-unknown证据质量: complete · 环境变体: 1 · 首次记录: 2026-09-02 · 最近观测: 2026-09-02诊断复验候选
-
已观测 UNKNOWN exit 1 证据缺口 ×1 v0.6.0 os=linux · runtime=go@1.26 sha256:6ed4679e28a1…expected logfmt.ErrUnsupportedKeyType for int key, got <nil> · exit status 1go · unclassified-diagnostic · outer go run · gap stage-unknown证据质量: complete · 环境变体: 1 · 首次记录: 2026-08-31 · 最近观测: 2026-08-31诊断复验候选
-
已观测 UNKNOWN exit 1 证据缺口 ×1 v0.6.0 os=linux · runtime=go@1.26 sha256:7d69c4f6d69b…assertion 5 failed: expected ErrInvalidKey, got <nil> · exit status 1go · unclassified-diagnostic · outer go run · gap stage-unknown证据质量: complete · 环境变体: 1 · 首次记录: 2026-08-31 · 最近观测: 2026-08-31诊断复验候选
-
已观测 UNKNOWN exit 1 证据缺口 ×1 v0.6.0 os=linux · runtime=go@1.26 sha256:7e1230015d91…expected logfmt.ErrInvalidKey for key with <str>, got <nil> · exit status 1go · unclassified-diagnostic · outer go run · gap stage-unknown证据质量: complete · 环境变体: 1 · 首次记录: 2026-08-31 · 最近观测: 2026-08-31诊断复验候选
-
已观测 PROJECT_COMPILE exit 1 ×1 v0.6.0 os=linux · runtime=go@1.26 sha256:bc86267941b4…<path> undefined: logfmt.ErrMissingValuego/compiler · compiler-diagnostic · outer go test证据质量: complete · 环境变体: 1 · 首次记录: 2026-09-02 · 最近观测: 2026-09-02
-
已观测 PROJECT_TEST exit 1 ×1 v0.6.0 os=linux · runtime=go@1.26 sha256:2681fa3ac3d6…--- FAIL: TestContractMarshalKeyvals (0.00s) · FAIL example.com/sample 0.003sgo/test · test-runner-diagnostic · outer go test证据质量: complete · 环境变体: 1 · 首次记录: 2026-09-02 · 最近观测: 2026-09-02
-
已观测 UNKNOWN exit 1 证据缺口 ×1 v0.6.0 os=linux · runtime=go@1.26 sha256:88cc5cb04e23…expected ErrInvalidKey for space in key, got <nil> · exit status 1go · unclassified-diagnostic · outer go run · gap stage-unknown证据质量: complete · 环境变体: 1 · 首次记录: 2026-09-02 · 最近观测: 2026-09-02诊断复验候选
-
已观测 UNKNOWN exit 1 证据缺口 ×1 v0.6.0 os=linux · runtime=go@1.26 sha256:97356d0a60a7…expected empty string quoted in output, got <str>he said \\\<str>\<str>line1\\nline2\<str> · exit status 1go · unclassified-diagnostic · outer go run · gap stage-unknown证据质量: complete · 环境变体: 1 · 首次记录: 2026-09-02 · 最近观测: 2026-09-02诊断复验候选