Relevéscargotwox-hash2.1.4
Détail de l'environnement
Les observations au niveau projet et les vérifications de symbole/contrat sont comptées séparément et jamais additionnées.
Ces chiffres ne distinguent pas la façon dont le symbole a été appelé : surcharges, formes d'arguments et options sont regroupées. Ce que fait une forme d'appel précise est prouvé par le contrat d'un échantillon, pas par ces nombres.
| Environnement | Confiance | Observations | Vérifié | Taux de réussite | Pairs | Dernière observation |
|---|---|---|---|---|---|---|
| unknown · Rust · cargo · linux glibc
Observations: PROJECT_COMPILE 2✓ 6✕ · PROJECT_PROCESS 8✓ — Vérifié: UNKNOWN 0✓ 1✕
|
ELEVATED FAILURE | 16 | 1 | 59 % | 1 | 2026-09-19 |
Clusters d'échecs récents
-
observé PROJECT_COMPILE exit 101 E0599 ×2 2.1.4 os=linux sha256:40827ed62704…error[E0599]: no method named `is_none` found for tuple `(u64, u64, addr2line::Location<'_>)` in the current scoperust/rustc · compiler-diagnostic · outer cargo runQualité de preuve: complete · Variantes d’environnement: 1 · Premier relevé: 2026-09-19 · Dernière observation: 2026-09-19
-
observé PROJECT_COMPILE exit 101 ×1 2.1.4 os=linux sha256:7e12f411f813…error: could not compile `test_addr2line` (bin <str>) due to 1 previous errorrust/rustc · compiler-diagnostic · outer cargo runQualité de preuve: complete · Variantes d’environnement: 1 · Premier relevé: 2026-09-19 · Dernière observation: 2026-09-19
-
observé PROJECT_COMPILE exit 101 ×1 2.1.4 os=linux sha256:9d9b6169d6bd…error: could not compile `test_addr2line` (bin <str>) due to 9 previous errorsrust/rustc · compiler-diagnostic · outer cargo runQualité de preuve: complete · Variantes d’environnement: 1 · Premier relevé: 2026-09-19 · Dernière observation: 2026-09-19
-
observé PROJECT_COMPILE exit 101 E0063 ×1 2.1.4 os=linux sha256:b4d73c642e61…error[E0063]: missing fields `debug_macinfo` and `debug_macro` in initializer of `Dwarf<_>`rust/rustc · compiler-diagnostic · outer cargo runQualité de preuve: complete · Variantes d’environnement: 1 · Premier relevé: 2026-09-19 · Dernière observation: 2026-09-19
-
observé PROJECT_COMPILE exit 101 E0061 ×1 2.1.4 os=linux sha256:db7a3103c11e…error[E0061]: this function takes 2 arguments but 1 argument was suppliedrust/rustc · compiler-diagnostic · outer cargo runQualité de preuve: complete · Variantes d’environnement: 1 · Premier relevé: 2026-09-19 · Dernière observation: 2026-09-19
-
observé UNKNOWN exit 101 Lacune de preuve ×1 2.1.4 os=linux sha256:c970c257481f…Compiling cfg-if v1.0.5 · Compiling simd-adler32 v0.3.10 · Compiling adler2 v2.0.1 · Compiling crc32fast v1.5.2cargo · unclassified-diagnostic · outer cargo run · gap stage-unknownQualité de preuve: complete · Variantes d’environnement: 1 · Premier relevé: 2026-09-19 · Dernière observation: 2026-09-19Candidat à une revérification diagnostique
Symboles
Pas encore de symboles avec des preuves.