Recordscargotwox-hash2.1.4
Environment detail
Project-level observations and symbol/contract verifications are counted separately and never combined.
These counts do not distinguish how the symbol was called: overloads, argument shapes and options are pooled together. What a particular call shape does is proven by a sample's contract, not by these numbers.
| Environment | Confidence | Observations | Verified | Pass rate | Peers | Last seen |
|---|---|---|---|---|---|---|
| unknown · Rust · cargo · linux glibc
Observations: PROJECT_COMPILE 2✓ 6✕ · PROJECT_PROCESS 8✓ — Verified: UNKNOWN 0✓ 1✕
|
ELEVATED FAILURE | 16 | 1 | 59% | 1 | 2026-09-19 |
Recent failure clusters
-
observed PROJECT_COMPILE exit 101 E0599 ×2 2.1.4 os=linux sha256:40827ed62704…error[E0599]: no method named `is_none` found for tuple `(u64, u64, addr2line::Location<'_>)` in the current scoperust/rustc · compiler-diagnostic · outer cargo runEvidence quality: complete · Environment variants: 1 · First recorded: 2026-09-19 · Last seen: 2026-09-19
-
observed PROJECT_COMPILE exit 101 ×1 2.1.4 os=linux sha256:7e12f411f813…error: could not compile `test_addr2line` (bin <str>) due to 1 previous errorrust/rustc · compiler-diagnostic · outer cargo runEvidence quality: complete · Environment variants: 1 · First recorded: 2026-09-19 · Last seen: 2026-09-19
-
observed PROJECT_COMPILE exit 101 ×1 2.1.4 os=linux sha256:9d9b6169d6bd…error: could not compile `test_addr2line` (bin <str>) due to 9 previous errorsrust/rustc · compiler-diagnostic · outer cargo runEvidence quality: complete · Environment variants: 1 · First recorded: 2026-09-19 · Last seen: 2026-09-19
-
observed PROJECT_COMPILE exit 101 E0063 ×1 2.1.4 os=linux sha256:b4d73c642e61…error[E0063]: missing fields `debug_macinfo` and `debug_macro` in initializer of `Dwarf<_>`rust/rustc · compiler-diagnostic · outer cargo runEvidence quality: complete · Environment variants: 1 · First recorded: 2026-09-19 · Last seen: 2026-09-19
-
observed PROJECT_COMPILE exit 101 E0061 ×1 2.1.4 os=linux sha256:db7a3103c11e…error[E0061]: this function takes 2 arguments but 1 argument was suppliedrust/rustc · compiler-diagnostic · outer cargo runEvidence quality: complete · Environment variants: 1 · First recorded: 2026-09-19 · Last seen: 2026-09-19
-
observed UNKNOWN exit 101 Evidence gap ×1 2.1.4 os=linux sha256:c970c257481f…Compiling cfg-if v1.0.5 · Compiling simd-adler32 v0.3.10 · Compiling adler2 v2.0.1 · Compiling crc32fast v1.5.2cargo · unclassified-diagnostic · outer cargo run · gap stage-unknownEvidence quality: complete · Environment variants: 1 · First recorded: 2026-09-19 · Last seen: 2026-09-19Diagnostic re-verification candidate
Symbols
No symbols with evidence yet.