Registroscargotokio-macros2.7.2tokio_macros::test
Exemplos publicados
- tokio-macros 2.7.2: tokio_macros::main, tokio_macros::test Esta rede oferece uma coisa: uma amostra que compila. Ela a executou em um sandbox e guardou o recibo assinado. Não classifica nem garante nada — se o mesmo código compila onde você está, ela não mediu. HOWtokio_macros::maintokio_macros::testrust MIT-0 · 2026-09-16
Matriz de compatibilidade
Observações no nível do projeto e verificações de símbolo/contrato são contadas separadamente e nunca somadas.
Estas contagens não distinguem como o símbolo foi chamado: sobrecargas, formatos de argumentos e opções são agrupados. O que uma forma de chamada específica faz é provado pelo contrato de uma amostra, não por estes números.
| Ambiente | Confiança | Observações | Verificado | Taxa de aprovação | Peers | Visto por último |
|---|---|---|---|---|---|---|
| unknown · Rust · cargo · linux glibc
Observações: PROJECT_COMPILE 0✓ 3✕ · PROJECT_PROCESS 1✓ · PROJECT_TEST 3✓
|
ELEVATED FAILURE | 7 | 0 | 57% | 1 | 2026-09-16 |
| rust 1 · Rust · cargo · linux musl · docker
Observações: PROJECT_TEST 2✓ — Verificado: CONTRACT 1✓
|
LOW | 2 | 1 | 100% | 1 · 1✓ | 2026-09-17 |
snapshot · 2026-09-17
Clusters de falha
-
observado PROJECT_COMPILE exit 101 E0308 ×1 2.7.2 os=linux tokio_macros::test sha256:0479254218ac…error[E0308]: mismatched typesrust/rustc · compiler-diagnostic · outer cargo testQualidade da evidência: complete · Variantes de ambiente: 1 · Primeiro registro: 2026-09-16 · Visto por último: 2026-09-16
-
observado PROJECT_COMPILE exit 101 E0433 ×1 2.7.2 os=linux tokio_macros::test sha256:76da7807743b…error[E0433]: cannot find `pin` in `tokio` · error[E0433]: cannot find `pin` in `tokio_macros_sample`rust/rustc · compiler-diagnostic · outer cargo testQualidade da evidência: complete · Variantes de ambiente: 1 · Primeiro registro: 2026-09-16 · Visto por último: 2026-09-16
-
observado PROJECT_COMPILE exit 101 ×1 2.7.2 os=linux tokio_macros::test sha256:ddfcd6108cf7…error: could not compile `tokio_macros_sample` (test <str>) due to 6 previous errorsrust/rustc · compiler-diagnostic · outer cargo testQualidade da evidência: complete · Variantes de ambiente: 1 · Primeiro registro: 2026-09-16 · Visto por último: 2026-09-16