Aufzeichnungencargotokio-macros2.7.2tokio_macros::test
Veröffentlichte Beispiele
- tokio-macros 2.7.2: tokio_macros::main, tokio_macros::test Dieses Netzwerk bietet eine Sache: ein Sample, das baut. Es hat es in einer Sandbox ausgeführt und die signierte Quittung behalten. Es bewertet nichts und garantiert nichts — ob derselbe Code bei Ihnen baut, hat es nicht gemessen. HOWtokio_macros::maintokio_macros::testrust MIT-0 · 2026-09-16
Kompatibilitätsmatrix
Beobachtungen auf Projektebene und Symbol-/Contract-Verifizierungen werden getrennt gezählt und niemals zusammengerechnet.
Diese Zahlen unterscheiden nicht, wie das Symbol aufgerufen wurde: Überladungen, Argumentformen und Optionen werden zusammengefasst. Was eine bestimmte Aufrufform tut, beweist der Vertrag eines Samples – nicht diese Zahlen.
| Umgebung | Konfidenz | Beobachtungen | Verifiziert | Erfolgsquote | Peers | Zuletzt gesehen |
|---|---|---|---|---|---|---|
| unknown · Rust · cargo · linux glibc
Beobachtungen: PROJECT_COMPILE 0✓ 3✕ · PROJECT_PROCESS 1✓ · PROJECT_TEST 3✓
|
ELEVATED FAILURE | 7 | 0 | 57 % | 1 | 2026-09-16 |
| rust 1 · Rust · cargo · linux musl · docker
Beobachtungen: PROJECT_TEST 2✓ — Verifiziert: CONTRACT 1✓
|
LOW | 2 | 1 | 100 % | 1 · 1✓ | 2026-09-17 |
snapshot · 2026-09-17
Fehler-Cluster
-
beobachtet PROJECT_COMPILE exit 101 E0308 ×1 2.7.2 os=linux tokio_macros::test sha256:0479254218ac…error[E0308]: mismatched typesrust/rustc · compiler-diagnostic · outer cargo testBeweisqualität: complete · Umgebungsvarianten: 1 · Zuerst erfasst: 2026-09-16 · Zuletzt gesehen: 2026-09-16
-
beobachtet PROJECT_COMPILE exit 101 E0433 ×1 2.7.2 os=linux tokio_macros::test sha256:76da7807743b…error[E0433]: cannot find `pin` in `tokio` · error[E0433]: cannot find `pin` in `tokio_macros_sample`rust/rustc · compiler-diagnostic · outer cargo testBeweisqualität: complete · Umgebungsvarianten: 1 · Zuerst erfasst: 2026-09-16 · Zuletzt gesehen: 2026-09-16
-
beobachtet PROJECT_COMPILE exit 101 ×1 2.7.2 os=linux tokio_macros::test sha256:ddfcd6108cf7…error: could not compile `tokio_macros_sample` (test <str>) due to 6 previous errorsrust/rustc · compiler-diagnostic · outer cargo testBeweisqualität: complete · Umgebungsvarianten: 1 · Zuerst erfasst: 2026-09-16 · Zuletzt gesehen: 2026-09-16