Registroscargothiserror-impl2.0.20
Qual símbolo rodou onde
Símbolos × sistemas operacionais desta versão. As células levam ao cubo de compatibilidade do pacote.
Como ler uma célula: O número são as observações registradas entre as quais a taxa divide — um build deixa uma observação por etapa que alcançou, então não conta builds, nem máquinas, nem pessoas. O documento ao lado é outro fato, de outra fonte: se existe uma amostra naquela coordenada e como foi a nossa execução dela ali.
- ainda sem amostra nesta coordenada
- há uma amostra aqui e ainda não a executamos nesta coordenada
- há uma amostra aqui e nossa execução nesta coordenada terminou limpa
- há uma amostra aqui e nossa execução nesta coordenada falhou
- há uma amostra aqui e esta coordenada registra ao mesmo tempo uma execução aprovada e uma reprovada
- nada registrado — desconhecido, nem “funciona” nem “quebrado”
- há um nível abaixo desta célula — clique para abrir
Um documento significa que há uma amostra naquela coordenada. Se ela EXISTE é um fato sobre esta versão e esta API e não muda com o sistema operacional, o runtime ou o gerenciador de pacotes; a COR diz como essa amostra rodou no ambiente que você está vendo.
Detalhe do ambiente
Observações no nível do projeto e verificações de símbolo/contrato são contadas separadamente e nunca somadas.
Estas contagens não distinguem como o símbolo foi chamado: sobrecargas, formatos de argumentos e opções são agrupados. O que uma forma de chamada específica faz é provado pelo contrato de uma amostra, não por estes números.
| Ambiente | Confiança | Observações | Verificado | Taxa de aprovação | Peers | Visto por último |
|---|---|---|---|---|---|---|
| unknown · Rust · cargo · linux glibc
Observações: PROJECT_COMPILE 3✓ 5✕ · PROJECT_PROCESS 5✓ — Uso: USED 2✓
|
ELEVATED FAILURE | 13 +2 | 0 | 62% | 1 | 2026-09-19 |
| rust 1 · Rust · cargo · linux musl · docker
Uso: USED 1✓
|
LOW | 0 +1 | 0 | — | 1 | 2026-09-08 |
Clusters de falha recentes
-
observado PROJECT_COMPILE exit 101 ×1 2.0.20 os=linux thiserror_impl::Error sha256:4c09382245cf…error: could not compile `test_cargo` (bin <str>) due to 1 previous errorrust/rustc · compiler-diagnostic · outer cargo checkQualidade da evidência: complete · Variantes de ambiente: 1 · Primeiro registro: 2026-09-19 · Visto por último: 2026-09-19
-
observado PROJECT_COMPILE exit 101 E0433 ×1 2.0.20 os=linux thiserror_impl::Error sha256:963d5ad492f6…error[E0433]: cannot find `__private20` in `thiserror`rust/rustc · compiler-diagnostic · outer cargo checkQualidade da evidência: complete · Variantes de ambiente: 1 · Primeiro registro: 2026-09-19 · Visto por último: 2026-09-19
-
observado PROJECT_COMPILE exit 101 ×1 2.0.20 os=linux thiserror_impl::Error sha256:be5055744d31…error: could not compile `test_cargo` (bin <str>) due to 2 previous errorsrust/rustc · compiler-diagnostic · outer cargo runQualidade da evidência: complete · Variantes de ambiente: 1 · Primeiro registro: 2026-09-19 · Visto por último: 2026-09-19
-
observado PROJECT_COMPILE exit 101 E0432 ×1 2.0.20 os=linux thiserror_impl::Error sha256:dd2ae662f4db…error[E0432]: unresolved import `thiserror`rust/rustc · compiler-diagnostic · outer cargo runQualidade da evidência: complete · Variantes de ambiente: 1 · Primeiro registro: 2026-09-19 · Visto por último: 2026-09-19
-
observado PROJECT_COMPILE exit 101 E0599 ×1 2.0.20 os=linux thiserror_impl::Error sha256:f07bb2beb9ac…error[E0599]: no method named `as_display` found for reference `&String` in the current scoperust/rustc · compiler-diagnostic · outer cargo runQualidade da evidência: complete · Variantes de ambiente: 1 · Primeiro registro: 2026-09-19 · Visto por último: 2026-09-19