記録cargothiserror-impl2.0.20
どのシンボルがどこで動いたか
このバージョンのシンボル × OS です。セルをクリックすると、パッケージの互換性キューブに掘り下げられます。
○ 12026-09-19
セルの読み方: 数字は割合が依拠する記録済み観測の数です — 1 回のビルドは到達した段階ごとに観測を 1 件残すため、ビルド数でもマシン数でも人数でもありません。隣の文書は出所の異なる別の事実です。その座標にサンプルがあるか、そして私たちがそこで実行した結果がどうだったかです。
- この座標にはまだサンプルがない
- サンプルあり — この座標ではまだ実行していない
- サンプルあり — この座標で実行し、問題なく終わった
- サンプルあり — この座標で実行し、失敗した
- サンプルあり — この座標には成功した実行と失敗した実行の両方が記録されている
- 記録なし — 不明であって「動く」でも「壊れている」でもない
- このセルの下にまだ段階がある — クリックで開く
文書があれば、その座標にサンプルがあるということです。サンプルが存在するかどうかはこのリリースとこの API についての事実で、OS・ランタイム・パッケージマネージャが変わっても変わりません。色は、今見ている環境でそのサンプルがどう実行されたかを示します。
環境の詳細
プロジェクトレベルの観測とシンボル/コントラクト検証は別々に集計し、決して合算しません。
これらの数値は、シンボルがどう呼び出されたかを区別しません。オーバーロード、引数の形、オプションはまとめて集計されます。特定の呼び出し方がどう動くかは、この数値ではなくサンプルの契約が証明します。
| 環境 | 信頼度 | 観測 | 検証 | 成功率 | ピア | 最終観測 |
|---|---|---|---|---|---|---|
| unknown · Rust · cargo · linux glibc
観測: PROJECT_COMPILE 3✓ 5✕ · PROJECT_PROCESS 5✓ — 使用: USED 2✓
|
ELEVATED FAILURE | 13 +2 | 0 | 62% | 1 | 2026-09-19 |
| rust 1 · Rust · cargo · linux musl · docker
使用: USED 1✓
|
LOW | 0 +1 | 0 | — | 1 | 2026-09-08 |
最近の失敗クラスター
-
観測済み PROJECT_COMPILE exit 101 ×1 2.0.20 os=linux thiserror_impl::Error sha256:4c09382245cf…error: could not compile `test_cargo` (bin <str>) due to 1 previous errorrust/rustc · compiler-diagnostic · outer cargo check証拠品質: complete · 環境バリアント: 1 · 初回記録: 2026-09-19 · 最終観測: 2026-09-19
-
観測済み PROJECT_COMPILE exit 101 E0433 ×1 2.0.20 os=linux thiserror_impl::Error sha256:963d5ad492f6…error[E0433]: cannot find `__private20` in `thiserror`rust/rustc · compiler-diagnostic · outer cargo check証拠品質: complete · 環境バリアント: 1 · 初回記録: 2026-09-19 · 最終観測: 2026-09-19
-
観測済み PROJECT_COMPILE exit 101 ×1 2.0.20 os=linux thiserror_impl::Error sha256:be5055744d31…error: could not compile `test_cargo` (bin <str>) due to 2 previous errorsrust/rustc · compiler-diagnostic · outer cargo run証拠品質: complete · 環境バリアント: 1 · 初回記録: 2026-09-19 · 最終観測: 2026-09-19
-
観測済み PROJECT_COMPILE exit 101 E0432 ×1 2.0.20 os=linux thiserror_impl::Error sha256:dd2ae662f4db…error[E0432]: unresolved import `thiserror`rust/rustc · compiler-diagnostic · outer cargo run証拠品質: complete · 環境バリアント: 1 · 初回記録: 2026-09-19 · 最終観測: 2026-09-19
-
観測済み PROJECT_COMPILE exit 101 E0599 ×1 2.0.20 os=linux thiserror_impl::Error sha256:f07bb2beb9ac…error[E0599]: no method named `as_display` found for reference `&String` in the current scoperust/rustc · compiler-diagnostic · outer cargo run証拠品質: complete · 環境バリアント: 1 · 初回記録: 2026-09-19 · 最終観測: 2026-09-19