Recordscargothiserror-impl2.0.20thiserror_impl::Error
Compatibility matrix
Project-level observations and symbol/contract verifications are counted separately and never combined.
These counts do not distinguish how the symbol was called: overloads, argument shapes and options are pooled together. What a particular call shape does is proven by a sample's contract, not by these numbers.
| Environment | Confidence | Observations | Verified | Pass rate | Peers | Last seen |
|---|---|---|---|---|---|---|
| unknown · Rust · cargo · linux glibc
Observations: PROJECT_COMPILE 1✓ 5✕ · PROJECT_PROCESS 5✓
|
ELEVATED FAILURE | 11 | 0 | 55% | 1 | 2026-09-19 |
snapshot · 2026-10-09
Failure clusters
-
observed PROJECT_COMPILE exit 101 ×1 2.0.20 os=linux thiserror_impl::Error sha256:4c09382245cf…error: could not compile `test_cargo` (bin <str>) due to 1 previous errorrust/rustc · compiler-diagnostic · outer cargo checkEvidence quality: complete · Environment variants: 1 · First recorded: 2026-09-19 · Last seen: 2026-09-19
-
observed PROJECT_COMPILE exit 101 E0433 ×1 2.0.20 os=linux thiserror_impl::Error sha256:963d5ad492f6…error[E0433]: cannot find `__private20` in `thiserror`rust/rustc · compiler-diagnostic · outer cargo checkEvidence quality: complete · Environment variants: 1 · First recorded: 2026-09-19 · Last seen: 2026-09-19
-
observed PROJECT_COMPILE exit 101 ×1 2.0.20 os=linux thiserror_impl::Error sha256:be5055744d31…error: could not compile `test_cargo` (bin <str>) due to 2 previous errorsrust/rustc · compiler-diagnostic · outer cargo runEvidence quality: complete · Environment variants: 1 · First recorded: 2026-09-19 · Last seen: 2026-09-19
-
observed PROJECT_COMPILE exit 101 E0432 ×1 2.0.20 os=linux thiserror_impl::Error sha256:dd2ae662f4db…error[E0432]: unresolved import `thiserror`rust/rustc · compiler-diagnostic · outer cargo runEvidence quality: complete · Environment variants: 1 · First recorded: 2026-09-19 · Last seen: 2026-09-19
-
observed PROJECT_COMPILE exit 101 E0599 ×1 2.0.20 os=linux thiserror_impl::Error sha256:f07bb2beb9ac…error[E0599]: no method named `as_display` found for reference `&String` in the current scoperust/rustc · compiler-diagnostic · outer cargo runEvidence quality: complete · Environment variants: 1 · First recorded: 2026-09-19 · Last seen: 2026-09-19