Registroscargothiserror-impl2.0.20thiserror_impl::Error
Matriz de compatibilidad
Las observaciones a nivel de proyecto y las verificaciones de símbolo/contrato se cuentan por separado y nunca se combinan.
Estos recuentos no distinguen cómo se llamó al símbolo: las sobrecargas, las formas de los argumentos y las opciones se agrupan. Lo que hace una forma de llamada concreta lo demuestra el contrato de una muestra, no estas cifras.
| Entorno | Confianza | Observaciones | Verificado | Tasa de éxito | Pares | Última observación |
|---|---|---|---|---|---|---|
| unknown · Rust · cargo · linux glibc
Observaciones: PROJECT_COMPILE 1✓ 5✕ · PROJECT_PROCESS 5✓
|
ELEVATED FAILURE | 11 | 0 | 55% | 1 | 2026-09-19 |
snapshot · 2026-10-09
Clústeres de fallos
-
observado PROJECT_COMPILE exit 101 ×1 2.0.20 os=linux thiserror_impl::Error sha256:4c09382245cf…error: could not compile `test_cargo` (bin <str>) due to 1 previous errorrust/rustc · compiler-diagnostic · outer cargo checkCalidad de evidencia: complete · Variantes de entorno: 1 · Primer registro: 2026-09-19 · Última observación: 2026-09-19
-
observado PROJECT_COMPILE exit 101 E0433 ×1 2.0.20 os=linux thiserror_impl::Error sha256:963d5ad492f6…error[E0433]: cannot find `__private20` in `thiserror`rust/rustc · compiler-diagnostic · outer cargo checkCalidad de evidencia: complete · Variantes de entorno: 1 · Primer registro: 2026-09-19 · Última observación: 2026-09-19
-
observado PROJECT_COMPILE exit 101 ×1 2.0.20 os=linux thiserror_impl::Error sha256:be5055744d31…error: could not compile `test_cargo` (bin <str>) due to 2 previous errorsrust/rustc · compiler-diagnostic · outer cargo runCalidad de evidencia: complete · Variantes de entorno: 1 · Primer registro: 2026-09-19 · Última observación: 2026-09-19
-
observado PROJECT_COMPILE exit 101 E0432 ×1 2.0.20 os=linux thiserror_impl::Error sha256:dd2ae662f4db…error[E0432]: unresolved import `thiserror`rust/rustc · compiler-diagnostic · outer cargo runCalidad de evidencia: complete · Variantes de entorno: 1 · Primer registro: 2026-09-19 · Última observación: 2026-09-19
-
observado PROJECT_COMPILE exit 101 E0599 ×1 2.0.20 os=linux thiserror_impl::Error sha256:f07bb2beb9ac…error[E0599]: no method named `as_display` found for reference `&String` in the current scoperust/rustc · compiler-diagnostic · outer cargo runCalidad de evidencia: complete · Variantes de entorno: 1 · Primer registro: 2026-09-19 · Última observación: 2026-09-19