记录cargosyn3.0.9
环境详情
项目级观测与符号/契约验证分别统计,绝不合并。
这些计数不区分符号的调用方式:重载、参数形态和选项被合并统计。某一具体调用方式的行为由样本的契约证明,而不是由这些数字证明。
| 环境 | 置信度 | 观测 | 验证 | 通过率 | 节点 | 最近观测 |
|---|---|---|---|---|---|---|
| unknown · Rust · cargo · linux glibc
观测: PROJECT_COMPILE 0✓ 6✕ · PROJECT_PROCESS 19✓ — 使用: USED 1✓ — 验证: UNKNOWN 0✓ 9✕
|
ELEVATED FAILURE | 25 +1 | 9 | 56% | 1 | 2026-10-19 |
| rust 1 · Rust · cargo · linux musl · docker
使用: USED 3✓
|
LOW | 0 +3 | 0 | — | 1 | 2026-10-19 |
近期失败聚类
-
已观测 UNKNOWN exit 101 证据缺口 ×2 3.0.9 os=linux sha256:8f78f52362b8…Updating crates.io index · Locking 7 packages to latest compatible versions · Adding wasm-bindgen-macro-support v0.2.128 (available: v0.2.129) …cargo · unclassified-diagnostic · outer cargo run · gap stage-unknown证据质量: complete · 环境变体: 1 · 首次记录: 2026-10-17 · 最近观测: 2026-10-17诊断复验候选
-
已观测 PROJECT_COMPILE exit 101 ×1 3.0.9 os=linux sha256:92ea19e5526e…error: could not compile `sample-expand-class-marker` (bin <str>) due to 1 previous errorrust/rustc · compiler-diagnostic · outer cargo run证据质量: complete · 环境变体: 1 · 首次记录: 2026-10-17 · 最近观测: 2026-10-17
-
已观测 PROJECT_COMPILE exit 101 E0599 ×1 3.0.9 os=linux sha256:eaa7d8163513…error[E0599]: no method named `into_node` found for struct `wasm_bindgen_macro_support::error::Diagnostic` in the current scoperust/rustc · compiler-diagnostic · outer cargo run证据质量: complete · 环境变体: 1 · 首次记录: 2026-10-17 · 最近观测: 2026-10-17
-
已观测 UNKNOWN signal ABORTED 证据缺口 ×1 3.0.9 os=linux sha256:034c59ed23d6…Compiling sample-wasm-bindgen v0.1.0 (<path> · Finished `dev` profile [unoptimized + debuginfo] target(s) in 0.19s …cargo · unclassified-diagnostic · outer cargo run · gap stage-unknown证据质量: complete · 环境变体: 1 · 首次记录: 2026-10-17 · 最近观测: 2026-10-17诊断复验候选
-
已观测 UNKNOWN exit 101 证据缺口 ×1 3.0.9 os=linux sha256:38c7f7eae057…Compiling sample-expand-class-marker v0.1.0 (<path> · Finished `dev` profile [unoptimized + debuginfo] target(s) in 1.03s …cargo · unclassified-diagnostic · outer cargo run · gap stage-unknown证据质量: complete · 环境变体: 1 · 首次记录: 2026-10-17 · 最近观测: 2026-10-17诊断复验候选
-
已观测 UNKNOWN exit 101 证据缺口 ×1 3.0.9 os=linux sha256:3cad07d3a07c…Compiling sample-wasm-bindgen-macro-support v0.1.0 (<path> · Finished `dev` profile [unoptimized + debuginfo] target(s) in 0.53s …cargo · unclassified-diagnostic · outer cargo run · gap stage-unknown证据质量: complete · 环境变体: 1 · 首次记录: 2026-10-17 · 最近观测: 2026-10-17诊断复验候选
-
已观测 UNKNOWN exit 101 证据缺口 ×1 3.0.9 os=linux sha256:49fbc1f03025…Compiling sample-wasm-bindgen v0.1.0 (<path> · Finished `dev` profile [unoptimized + debuginfo] target(s) in 0.33s …cargo · unclassified-diagnostic · outer cargo run · gap stage-unknown证据质量: complete · 环境变体: 1 · 首次记录: 2026-10-17 · 最近观测: 2026-10-17诊断复验候选
-
已观测 UNKNOWN exit 101 证据缺口 ×1 3.0.9 os=linux sha256:ce88fa682bac…Updating crates.io index · Locking 12 packages to latest compatible versions · Adding wasm-bindgen v0.2.128 (available: v0.2.129) …cargo · unclassified-diagnostic · outer cargo run · gap stage-unknown证据质量: complete · 环境变体: 1 · 首次记录: 2026-10-17 · 最近观测: 2026-10-17诊断复验候选
-
已观测 UNKNOWN exit 101 证据缺口 ×1 3.0.9 os=linux sha256:d5ef89c0ce65…Compiling sample-wasm-bindgen v0.1.0 (<path> · Finished `dev` profile [unoptimized + debuginfo] target(s) in 0.25s …cargo · unclassified-diagnostic · outer cargo run · gap stage-unknown证据质量: complete · 环境变体: 1 · 首次记录: 2026-10-17 · 最近观测: 2026-10-17诊断复验候选
-
已观测 UNKNOWN exit 101 证据缺口 ×1 3.0.9 os=linux sha256:e0ded99321af…Compiling sample-wasm-bindgen v0.1.0 (<path> · Finished `dev` profile [unoptimized + debuginfo] target(s) in 0.46s …cargo · unclassified-diagnostic · outer cargo run · gap stage-unknown证据质量: complete · 环境变体: 1 · 首次记录: 2026-10-17 · 最近观测: 2026-10-17诊断复验候选
-
已观测 PROJECT_COMPILE exit 101 ×1 3.0.9 os=linux sha256:5f8e4e2b88b7…error: could not compile `sample-idna-adapter` (bin <str>) due to 2 previous errorsrust/rustc · compiler-diagnostic · outer cargo run证据质量: complete · 环境变体: 1 · 首次记录: 2026-10-19 · 最近观测: 2026-10-19
-
已观测 PROJECT_COMPILE exit 101 E0599 ×1 3.0.9 os=linux sha256:c2fafad2bab2…error[E0599]: no method named `is_rtl` found for struct `BidiClass` in the current scoperust/rustc · compiler-diagnostic · outer cargo run证据质量: complete · 环境变体: 1 · 首次记录: 2026-10-19 · 最近观测: 2026-10-19
显示报告最多的 12 个。此坐标记录的失败聚类共 14 个。其余为单次报告。
符号
暂无带证据的符号。