Recordscargosyn3.0.9
Environment detail
Project-level observations and symbol/contract verifications are counted separately and never combined.
These counts do not distinguish how the symbol was called: overloads, argument shapes and options are pooled together. What a particular call shape does is proven by a sample's contract, not by these numbers.
| Environment | Confidence | Observations | Verified | Pass rate | Peers | Last seen |
|---|---|---|---|---|---|---|
| unknown · Rust · cargo · linux glibc
Observations: PROJECT_COMPILE 0✓ 6✕ · PROJECT_PROCESS 19✓ — Usage: USED 1✓ — Verified: UNKNOWN 0✓ 9✕
|
ELEVATED FAILURE | 25 +1 | 9 | 56% | 1 | 2026-10-19 |
| rust 1 · Rust · cargo · linux musl · docker
Usage: USED 3✓
|
LOW | 0 +3 | 0 | — | 1 | 2026-10-19 |
Recent failure clusters
-
observed UNKNOWN exit 101 Evidence gap ×2 3.0.9 os=linux sha256:8f78f52362b8…Updating crates.io index · Locking 7 packages to latest compatible versions · Adding wasm-bindgen-macro-support v0.2.128 (available: v0.2.129) …cargo · unclassified-diagnostic · outer cargo run · gap stage-unknownEvidence quality: complete · Environment variants: 1 · First recorded: 2026-10-17 · Last seen: 2026-10-17Diagnostic re-verification candidate
-
observed PROJECT_COMPILE exit 101 ×1 3.0.9 os=linux sha256:92ea19e5526e…error: could not compile `sample-expand-class-marker` (bin <str>) due to 1 previous errorrust/rustc · compiler-diagnostic · outer cargo runEvidence quality: complete · Environment variants: 1 · First recorded: 2026-10-17 · Last seen: 2026-10-17
-
observed PROJECT_COMPILE exit 101 E0599 ×1 3.0.9 os=linux sha256:eaa7d8163513…error[E0599]: no method named `into_node` found for struct `wasm_bindgen_macro_support::error::Diagnostic` in the current scoperust/rustc · compiler-diagnostic · outer cargo runEvidence quality: complete · Environment variants: 1 · First recorded: 2026-10-17 · Last seen: 2026-10-17
-
observed UNKNOWN signal ABORTED Evidence gap ×1 3.0.9 os=linux sha256:034c59ed23d6…Compiling sample-wasm-bindgen v0.1.0 (<path> · Finished `dev` profile [unoptimized + debuginfo] target(s) in 0.19s …cargo · unclassified-diagnostic · outer cargo run · gap stage-unknownEvidence quality: complete · Environment variants: 1 · First recorded: 2026-10-17 · Last seen: 2026-10-17Diagnostic re-verification candidate
-
observed UNKNOWN exit 101 Evidence gap ×1 3.0.9 os=linux sha256:38c7f7eae057…Compiling sample-expand-class-marker v0.1.0 (<path> · Finished `dev` profile [unoptimized + debuginfo] target(s) in 1.03s …cargo · unclassified-diagnostic · outer cargo run · gap stage-unknownEvidence quality: complete · Environment variants: 1 · First recorded: 2026-10-17 · Last seen: 2026-10-17Diagnostic re-verification candidate
-
observed UNKNOWN exit 101 Evidence gap ×1 3.0.9 os=linux sha256:3cad07d3a07c…Compiling sample-wasm-bindgen-macro-support v0.1.0 (<path> · Finished `dev` profile [unoptimized + debuginfo] target(s) in 0.53s …cargo · unclassified-diagnostic · outer cargo run · gap stage-unknownEvidence quality: complete · Environment variants: 1 · First recorded: 2026-10-17 · Last seen: 2026-10-17Diagnostic re-verification candidate
-
observed UNKNOWN exit 101 Evidence gap ×1 3.0.9 os=linux sha256:49fbc1f03025…Compiling sample-wasm-bindgen v0.1.0 (<path> · Finished `dev` profile [unoptimized + debuginfo] target(s) in 0.33s …cargo · unclassified-diagnostic · outer cargo run · gap stage-unknownEvidence quality: complete · Environment variants: 1 · First recorded: 2026-10-17 · Last seen: 2026-10-17Diagnostic re-verification candidate
-
observed UNKNOWN exit 101 Evidence gap ×1 3.0.9 os=linux sha256:ce88fa682bac…Updating crates.io index · Locking 12 packages to latest compatible versions · Adding wasm-bindgen v0.2.128 (available: v0.2.129) …cargo · unclassified-diagnostic · outer cargo run · gap stage-unknownEvidence quality: complete · Environment variants: 1 · First recorded: 2026-10-17 · Last seen: 2026-10-17Diagnostic re-verification candidate
-
observed UNKNOWN exit 101 Evidence gap ×1 3.0.9 os=linux sha256:d5ef89c0ce65…Compiling sample-wasm-bindgen v0.1.0 (<path> · Finished `dev` profile [unoptimized + debuginfo] target(s) in 0.25s …cargo · unclassified-diagnostic · outer cargo run · gap stage-unknownEvidence quality: complete · Environment variants: 1 · First recorded: 2026-10-17 · Last seen: 2026-10-17Diagnostic re-verification candidate
-
observed UNKNOWN exit 101 Evidence gap ×1 3.0.9 os=linux sha256:e0ded99321af…Compiling sample-wasm-bindgen v0.1.0 (<path> · Finished `dev` profile [unoptimized + debuginfo] target(s) in 0.46s …cargo · unclassified-diagnostic · outer cargo run · gap stage-unknownEvidence quality: complete · Environment variants: 1 · First recorded: 2026-10-17 · Last seen: 2026-10-17Diagnostic re-verification candidate
-
observed PROJECT_COMPILE exit 101 ×1 3.0.9 os=linux sha256:5f8e4e2b88b7…error: could not compile `sample-idna-adapter` (bin <str>) due to 2 previous errorsrust/rustc · compiler-diagnostic · outer cargo runEvidence quality: complete · Environment variants: 1 · First recorded: 2026-10-19 · Last seen: 2026-10-19
-
observed PROJECT_COMPILE exit 101 E0599 ×1 3.0.9 os=linux sha256:c2fafad2bab2…error[E0599]: no method named `is_rtl` found for struct `BidiClass` in the current scoperust/rustc · compiler-diagnostic · outer cargo runEvidence quality: complete · Environment variants: 1 · First recorded: 2026-10-19 · Last seen: 2026-10-19
Showing the 12 most-reported of 14 recorded failure clusters. The rest are single reports.
Symbols
No symbols with evidence yet.