Registroscargoserde_derive1.0.229
Qual símbolo rodou onde
Símbolos × sistemas operacionais desta versão. As células levam ao cubo de compatibilidade do pacote.
| alpine musl | ubuntu glibc | |
|---|---|---|
| Deserialize | 100%2 | |
| Serialize | 100%2 | |
| serde_derive | 100%1 | |
| serde_derive::Deserialize | 100%2 | 100%4 |
| serde_derive::Serialize | 100%4 |
Como ler uma célula: O número são as observações registradas entre as quais a taxa divide — um build deixa uma observação por etapa que alcançou, então não conta builds, nem máquinas, nem pessoas. O documento ao lado é outro fato, de outra fonte: se existe uma amostra naquela coordenada e como foi a nossa execução dela ali.
- ainda sem amostra nesta coordenada
- há uma amostra aqui e ainda não a executamos nesta coordenada
- há uma amostra aqui e nossa execução nesta coordenada terminou limpa
- há uma amostra aqui e nossa execução nesta coordenada falhou
- há uma amostra aqui e esta coordenada registra ao mesmo tempo uma execução aprovada e uma reprovada
- nada registrado — desconhecido, nem “funciona” nem “quebrado”
- há um nível abaixo desta célula — clique para abrir
Um documento significa que há uma amostra naquela coordenada. Se ela EXISTE é um fato sobre esta versão e esta API e não muda com o sistema operacional, o runtime ou o gerenciador de pacotes; a COR diz como essa amostra rodou no ambiente que você está vendo.
Detalhe do ambiente
Observações no nível do projeto e verificações de símbolo/contrato são contadas separadamente e nunca somadas.
Estas contagens não distinguem como o símbolo foi chamado: sobrecargas, formatos de argumentos e opções são agrupados. O que uma forma de chamada específica faz é provado pelo contrato de uma amostra, não por estes números.
| Ambiente | Confiança | Observações | Verificado | Taxa de aprovação | Peers | Visto por último |
|---|---|---|---|---|---|---|
| unknown · Rust · cargo · linux glibc
Observações: PROJECT_COMPILE 7✓ 7✕ · PROJECT_PROCESS 5✓ · PROJECT_TEST 1✓ — Uso: USED 2✓ — Verificado: UNKNOWN 0✓ 1✕
|
ELEVATED FAILURE | 20 +2 | 1 | 62% | 1 | 2026-09-14 |
| rust 1 · Rust · cargo · linux musl · docker
Observações: PROJECT_LOAD 2✓ · PROJECT_TEST 2✓ — Uso: USED 3✓ — Verificado: CONTRACT 4✓
|
LOW | 4 +3 | 4 | 100% | 1 · 1✓ | 2026-09-17 |
Clusters de falha recentes
-
observado PROJECT_COMPILE exit 101 E0433 ×1 1.0.229 os=linux sha256:4cea35867957…error[E0433]: cannot find `__private229` in `_serde` · error[E0433]: cannot find `Serializer` in `_serde` · error[E0433]: cannot find `ser` in `_serde`rust/rustc · compiler-diagnostic · outer cargo checkQualidade da evidência: complete · Variantes de ambiente: 1 · Primeiro registro: 2026-09-14 · Visto por último: 2026-09-14
-
observado PROJECT_COMPILE exit 101 E0283 ×1 1.0.229 os=linux sha256:55052d6fc8b2…error[E0283]: type annotations neededrust/rustc · compiler-diagnostic · outer cargo runQualidade da evidência: complete · Variantes de ambiente: 1 · Primeiro registro: 2026-09-14 · Visto por último: 2026-09-14
-
observado PROJECT_COMPILE exit 101 ×1 1.0.229 os=linux sha256:7461bf46226d…error: could not compile `sample-serde-core` (bin <str>) due to 3 previous errorsrust/rustc · compiler-diagnostic · outer cargo runQualidade da evidência: complete · Variantes de ambiente: 1 · Primeiro registro: 2026-09-14 · Visto por último: 2026-09-14
-
observado PROJECT_COMPILE exit 101 E0405 ×1 1.0.229 os=linux sha256:8a1088019b07…error[E0405]: cannot find trait `Serialize` in module `_serde` · error[E0405]: cannot find trait `Serializer` in module `_serde`rust/rustc · compiler-diagnostic · outer cargo checkQualidade da evidência: complete · Variantes de ambiente: 1 · Primeiro registro: 2026-09-14 · Visto por último: 2026-09-14
-
observado PROJECT_COMPILE exit 101 ×1 1.0.229 os=linux sha256:b21c095b1aba…error: could not compile `sample-serde-core` (bin <str>) due to 1 previous errorrust/rustc · compiler-diagnostic · outer cargo runQualidade da evidência: complete · Variantes de ambiente: 1 · Primeiro registro: 2026-09-14 · Visto por último: 2026-09-14
-
observado PROJECT_COMPILE exit 101 ×1 1.0.229 os=linux sha256:df160d9ca814…error: could not compile `sample-serde-derive` (bin <str>) due to 7 previous errorsrust/rustc · compiler-diagnostic · outer cargo checkQualidade da evidência: complete · Variantes de ambiente: 1 · Primeiro registro: 2026-09-14 · Visto por último: 2026-09-14
-
observado PROJECT_COMPILE exit 101 E0599 ×1 1.0.229 os=linux sha256:f713b890152f…error[E0599]: no method named `into_deserializer` found for enum `std::option::Option<T>` in the current scope …rust/rustc · compiler-diagnostic · outer cargo runQualidade da evidência: complete · Variantes de ambiente: 1 · Primeiro registro: 2026-09-14 · Visto por último: 2026-09-14
-
observado UNKNOWN exit 101 Lacuna de evidência ×1 1.0.229 os=linux sha256:eeb9864183a6…Compiling sample-serde-core v1.0.0 (<path> · Finished `dev` profile [unoptimized + debuginfo] target(s) in 0.27s · Running `target/debug/contract` …cargo · unclassified-diagnostic · outer cargo run · gap stage-unknownQualidade da evidência: complete · Variantes de ambiente: 1 · Primeiro registro: 2026-09-14 · Visto por último: 2026-09-14Candidato a reverificação diagnóstica
Símbolos
- Deserialize 1 compartilhado ×3 1 de 1 execuções passaram
- Serialize 1 1 de 1 execuções passaram
- serde_derive
- serde_derive::Deserialize 1 1 de 1 execuções passaram
- serde_derive::Serialize
Exemplos publicados
- serde_derive 1.0.229 Esta rede oferece uma coisa: uma amostra que compila. Ela a executou em um sandbox e guardou o recibo assinado. Não classifica nem garante nada — se o mesmo código compila onde você está, ela não mediu. HOW MIT-0 · 2026-09-14