Registroscargoserde_derive1.0.229
Qué símbolo se ejecutó dónde
Símbolos × sistemas operativos para esta versión. Las celdas llevan al cubo de compatibilidad del paquete.
| alpine musl | ubuntu glibc | |
|---|---|---|
| Deserialize | 100%2 | |
| Serialize | 100%2 | |
| serde_derive | 100%1 | |
| serde_derive::Deserialize | 100%2 | 100%4 |
| serde_derive::Serialize | 100%4 |
Cómo leer una celda: El número son las observaciones registradas entre las que divide la tasa: una compilación deja una observación por cada etapa que alcanzó, así que no cuenta compilaciones, ni máquinas, ni personas. El documento de al lado es otro hecho de otra fuente: si hay una muestra en esa coordenada y cómo fue nuestra ejecución de ella allí.
- todavía no hay muestra en esta coordenada
- hay una muestra aquí y todavía no la hemos ejecutado en esta coordenada
- hay una muestra aquí y nuestra ejecución en esta coordenada terminó limpia
- hay una muestra aquí y nuestra ejecución en esta coordenada falló
- hay una muestra aquí y esta coordenada registra a la vez una ejecución con éxito y otra con fallo
- nada registrado — desconocido, ni «funciona» ni «roto»
- hay un nivel bajo esta celda: haz clic para abrirlo
Un documento significa que hay una muestra en esa coordenada. Que EXISTA es un hecho sobre esta versión y esta API y no cambia con el sistema operativo, el runtime ni el gestor de paquetes; su COLOR es cómo se ejecutó esa muestra en el entorno que estás mirando.
Detalle del entorno
Las observaciones a nivel de proyecto y las verificaciones de símbolo/contrato se cuentan por separado y nunca se combinan.
Estos recuentos no distinguen cómo se llamó al símbolo: las sobrecargas, las formas de los argumentos y las opciones se agrupan. Lo que hace una forma de llamada concreta lo demuestra el contrato de una muestra, no estas cifras.
| Entorno | Confianza | Observaciones | Verificado | Tasa de éxito | Pares | Última observación |
|---|---|---|---|---|---|---|
| unknown · Rust · cargo · linux glibc
Observaciones: PROJECT_COMPILE 7✓ 7✕ · PROJECT_PROCESS 5✓ · PROJECT_TEST 1✓ — Uso: USED 2✓ — Verificado: UNKNOWN 0✓ 1✕
|
ELEVATED FAILURE | 20 +2 | 1 | 62% | 1 | 2026-09-14 |
| rust 1 · Rust · cargo · linux musl · docker
Observaciones: PROJECT_LOAD 2✓ · PROJECT_TEST 2✓ — Uso: USED 3✓ — Verificado: CONTRACT 4✓
|
LOW | 4 +3 | 4 | 100% | 1 · 1✓ | 2026-09-17 |
Clústeres de fallos recientes
-
observado PROJECT_COMPILE exit 101 E0433 ×1 1.0.229 os=linux sha256:4cea35867957…error[E0433]: cannot find `__private229` in `_serde` · error[E0433]: cannot find `Serializer` in `_serde` · error[E0433]: cannot find `ser` in `_serde`rust/rustc · compiler-diagnostic · outer cargo checkCalidad de evidencia: complete · Variantes de entorno: 1 · Primer registro: 2026-09-14 · Última observación: 2026-09-14
-
observado PROJECT_COMPILE exit 101 E0283 ×1 1.0.229 os=linux sha256:55052d6fc8b2…error[E0283]: type annotations neededrust/rustc · compiler-diagnostic · outer cargo runCalidad de evidencia: complete · Variantes de entorno: 1 · Primer registro: 2026-09-14 · Última observación: 2026-09-14
-
observado PROJECT_COMPILE exit 101 ×1 1.0.229 os=linux sha256:7461bf46226d…error: could not compile `sample-serde-core` (bin <str>) due to 3 previous errorsrust/rustc · compiler-diagnostic · outer cargo runCalidad de evidencia: complete · Variantes de entorno: 1 · Primer registro: 2026-09-14 · Última observación: 2026-09-14
-
observado PROJECT_COMPILE exit 101 E0405 ×1 1.0.229 os=linux sha256:8a1088019b07…error[E0405]: cannot find trait `Serialize` in module `_serde` · error[E0405]: cannot find trait `Serializer` in module `_serde`rust/rustc · compiler-diagnostic · outer cargo checkCalidad de evidencia: complete · Variantes de entorno: 1 · Primer registro: 2026-09-14 · Última observación: 2026-09-14
-
observado PROJECT_COMPILE exit 101 ×1 1.0.229 os=linux sha256:b21c095b1aba…error: could not compile `sample-serde-core` (bin <str>) due to 1 previous errorrust/rustc · compiler-diagnostic · outer cargo runCalidad de evidencia: complete · Variantes de entorno: 1 · Primer registro: 2026-09-14 · Última observación: 2026-09-14
-
observado PROJECT_COMPILE exit 101 ×1 1.0.229 os=linux sha256:df160d9ca814…error: could not compile `sample-serde-derive` (bin <str>) due to 7 previous errorsrust/rustc · compiler-diagnostic · outer cargo checkCalidad de evidencia: complete · Variantes de entorno: 1 · Primer registro: 2026-09-14 · Última observación: 2026-09-14
-
observado PROJECT_COMPILE exit 101 E0599 ×1 1.0.229 os=linux sha256:f713b890152f…error[E0599]: no method named `into_deserializer` found for enum `std::option::Option<T>` in the current scope …rust/rustc · compiler-diagnostic · outer cargo runCalidad de evidencia: complete · Variantes de entorno: 1 · Primer registro: 2026-09-14 · Última observación: 2026-09-14
-
observado UNKNOWN exit 101 Brecha de evidencia ×1 1.0.229 os=linux sha256:eeb9864183a6…Compiling sample-serde-core v1.0.0 (<path> · Finished `dev` profile [unoptimized + debuginfo] target(s) in 0.27s · Running `target/debug/contract` …cargo · unclassified-diagnostic · outer cargo run · gap stage-unknownCalidad de evidencia: complete · Variantes de entorno: 1 · Primer registro: 2026-09-14 · Última observación: 2026-09-14Candidato a reverificación diagnóstica
Símbolos
- Deserialize 1 compartido ×3 1 de 1 ejecuciones pasaron
- Serialize 1 1 de 1 ejecuciones pasaron
- serde_derive
- serde_derive::Deserialize 1 1 de 1 ejecuciones pasaron
- serde_derive::Serialize
Ejemplos publicados
- serde_derive 1.0.229 Esta red ofrece una sola cosa: una muestra que compila. La ejecutó en un sandbox y guardó el recibo firmado. No califica ni garantiza nada: si el mismo código compila donde estás no es algo que haya medido. HOW MIT-0 · 2026-09-14