记录cargoserde_derive1.0.229Deserialize
3 个包共同声明 — 此证据无法判断该 API 属于谁
已发布的示例
- serde_derive 1.0.229: Deserialize 本网络只提供一件事:能构建的样本。它在沙箱中运行并保留签名回执。它不评级、不担保——同样的代码能否在你的环境构建,它没有测量过。 HOWDeserialize MIT-0 · 2026-09-14
兼容性矩阵
项目级观测与符号/契约验证分别统计,绝不合并。
这些计数不区分符号的调用方式:重载、参数形态和选项被合并统计。某一具体调用方式的行为由样本的契约证明,而不是由这些数字证明。
| 环境 | 置信度 | 观测 | 验证 | 通过率 | 节点 | 最近观测 |
|---|---|---|---|---|---|---|
| rust 1 · Rust · cargo · linux musl · docker
观测: PROJECT_TEST 2✓ — 验证: CONTRACT 1✓
|
LOW | 2 | 1 | 100% | 1 · 1✓ | 2026-09-17 |
snapshot · 2026-09-17
失败聚类
-
已观测 PROJECT_COMPILE exit 101 E0433 ×1 1.0.229 os=linux sha256:4cea35867957…error[E0433]: cannot find `__private229` in `_serde` · error[E0433]: cannot find `Serializer` in `_serde` · error[E0433]: cannot find `ser` in `_serde`rust/rustc · compiler-diagnostic · outer cargo check证据质量: complete · 环境变体: 1 · 首次记录: 2026-09-14 · 最近观测: 2026-09-14
-
已观测 PROJECT_COMPILE exit 101 E0283 ×1 1.0.229 os=linux sha256:55052d6fc8b2…error[E0283]: type annotations neededrust/rustc · compiler-diagnostic · outer cargo run证据质量: complete · 环境变体: 1 · 首次记录: 2026-09-14 · 最近观测: 2026-09-14
-
已观测 PROJECT_COMPILE exit 101 ×1 1.0.229 os=linux sha256:7461bf46226d…error: could not compile `sample-serde-core` (bin <str>) due to 3 previous errorsrust/rustc · compiler-diagnostic · outer cargo run证据质量: complete · 环境变体: 1 · 首次记录: 2026-09-14 · 最近观测: 2026-09-14
-
已观测 PROJECT_COMPILE exit 101 E0405 ×1 1.0.229 os=linux sha256:8a1088019b07…error[E0405]: cannot find trait `Serialize` in module `_serde` · error[E0405]: cannot find trait `Serializer` in module `_serde`rust/rustc · compiler-diagnostic · outer cargo check证据质量: complete · 环境变体: 1 · 首次记录: 2026-09-14 · 最近观测: 2026-09-14
-
已观测 PROJECT_COMPILE exit 101 ×1 1.0.229 os=linux sha256:b21c095b1aba…error: could not compile `sample-serde-core` (bin <str>) due to 1 previous errorrust/rustc · compiler-diagnostic · outer cargo run证据质量: complete · 环境变体: 1 · 首次记录: 2026-09-14 · 最近观测: 2026-09-14
-
已观测 PROJECT_COMPILE exit 101 ×1 1.0.229 os=linux sha256:df160d9ca814…error: could not compile `sample-serde-derive` (bin <str>) due to 7 previous errorsrust/rustc · compiler-diagnostic · outer cargo check证据质量: complete · 环境变体: 1 · 首次记录: 2026-09-14 · 最近观测: 2026-09-14
-
已观测 PROJECT_COMPILE exit 101 E0599 ×1 1.0.229 os=linux sha256:f713b890152f…error[E0599]: no method named `into_deserializer` found for enum `std::option::Option<T>` in the current scope …rust/rustc · compiler-diagnostic · outer cargo run证据质量: complete · 环境变体: 1 · 首次记录: 2026-09-14 · 最近观测: 2026-09-14
-
已观测 UNKNOWN exit 101 证据缺口 ×1 1.0.229 os=linux sha256:eeb9864183a6…Compiling sample-serde-core v1.0.0 (<path> · Finished `dev` profile [unoptimized + debuginfo] target(s) in 0.27s · Running `target/debug/contract` …cargo · unclassified-diagnostic · outer cargo run · gap stage-unknown证据质量: complete · 环境变体: 1 · 首次记录: 2026-09-14 · 最近观测: 2026-09-14诊断复验候选