Aufzeichnungencargoserde_derive1.0.229Deserialize
von 3 Paketen beansprucht — dieser Beleg kann nicht sagen, wessen API es ist
Veröffentlichte Beispiele
- serde_derive 1.0.229: Deserialize Dieses Netzwerk bietet eine Sache: ein Sample, das baut. Es hat es in einer Sandbox ausgeführt und die signierte Quittung behalten. Es bewertet nichts und garantiert nichts — ob derselbe Code bei Ihnen baut, hat es nicht gemessen. HOWDeserialize MIT-0 · 2026-09-14
Kompatibilitätsmatrix
Beobachtungen auf Projektebene und Symbol-/Contract-Verifizierungen werden getrennt gezählt und niemals zusammengerechnet.
Diese Zahlen unterscheiden nicht, wie das Symbol aufgerufen wurde: Überladungen, Argumentformen und Optionen werden zusammengefasst. Was eine bestimmte Aufrufform tut, beweist der Vertrag eines Samples – nicht diese Zahlen.
| Umgebung | Konfidenz | Beobachtungen | Verifiziert | Erfolgsquote | Peers | Zuletzt gesehen |
|---|---|---|---|---|---|---|
| rust 1 · Rust · cargo · linux musl · docker
Beobachtungen: PROJECT_TEST 2✓ — Verifiziert: CONTRACT 1✓
|
LOW | 2 | 1 | 100 % | 1 · 1✓ | 2026-09-17 |
snapshot · 2026-09-17
Fehler-Cluster
-
beobachtet PROJECT_COMPILE exit 101 E0433 ×1 1.0.229 os=linux sha256:4cea35867957…error[E0433]: cannot find `__private229` in `_serde` · error[E0433]: cannot find `Serializer` in `_serde` · error[E0433]: cannot find `ser` in `_serde`rust/rustc · compiler-diagnostic · outer cargo checkBeweisqualität: complete · Umgebungsvarianten: 1 · Zuerst erfasst: 2026-09-14 · Zuletzt gesehen: 2026-09-14
-
beobachtet PROJECT_COMPILE exit 101 E0283 ×1 1.0.229 os=linux sha256:55052d6fc8b2…error[E0283]: type annotations neededrust/rustc · compiler-diagnostic · outer cargo runBeweisqualität: complete · Umgebungsvarianten: 1 · Zuerst erfasst: 2026-09-14 · Zuletzt gesehen: 2026-09-14
-
beobachtet PROJECT_COMPILE exit 101 ×1 1.0.229 os=linux sha256:7461bf46226d…error: could not compile `sample-serde-core` (bin <str>) due to 3 previous errorsrust/rustc · compiler-diagnostic · outer cargo runBeweisqualität: complete · Umgebungsvarianten: 1 · Zuerst erfasst: 2026-09-14 · Zuletzt gesehen: 2026-09-14
-
beobachtet PROJECT_COMPILE exit 101 E0405 ×1 1.0.229 os=linux sha256:8a1088019b07…error[E0405]: cannot find trait `Serialize` in module `_serde` · error[E0405]: cannot find trait `Serializer` in module `_serde`rust/rustc · compiler-diagnostic · outer cargo checkBeweisqualität: complete · Umgebungsvarianten: 1 · Zuerst erfasst: 2026-09-14 · Zuletzt gesehen: 2026-09-14
-
beobachtet PROJECT_COMPILE exit 101 ×1 1.0.229 os=linux sha256:b21c095b1aba…error: could not compile `sample-serde-core` (bin <str>) due to 1 previous errorrust/rustc · compiler-diagnostic · outer cargo runBeweisqualität: complete · Umgebungsvarianten: 1 · Zuerst erfasst: 2026-09-14 · Zuletzt gesehen: 2026-09-14
-
beobachtet PROJECT_COMPILE exit 101 ×1 1.0.229 os=linux sha256:df160d9ca814…error: could not compile `sample-serde-derive` (bin <str>) due to 7 previous errorsrust/rustc · compiler-diagnostic · outer cargo checkBeweisqualität: complete · Umgebungsvarianten: 1 · Zuerst erfasst: 2026-09-14 · Zuletzt gesehen: 2026-09-14
-
beobachtet PROJECT_COMPILE exit 101 E0599 ×1 1.0.229 os=linux sha256:f713b890152f…error[E0599]: no method named `into_deserializer` found for enum `std::option::Option<T>` in the current scope …rust/rustc · compiler-diagnostic · outer cargo runBeweisqualität: complete · Umgebungsvarianten: 1 · Zuerst erfasst: 2026-09-14 · Zuletzt gesehen: 2026-09-14
-
beobachtet UNKNOWN exit 101 Beweislücke ×1 1.0.229 os=linux sha256:eeb9864183a6…Compiling sample-serde-core v1.0.0 (<path> · Finished `dev` profile [unoptimized + debuginfo] target(s) in 0.27s · Running `target/debug/contract` …cargo · unclassified-diagnostic · outer cargo run · gap stage-unknownBeweisqualität: complete · Umgebungsvarianten: 1 · Zuerst erfasst: 2026-09-14 · Zuletzt gesehen: 2026-09-14Kandidat für diagnostische Neuprüfung