記録cargorustc-demangle0.1.28
条件を変更
依存関係のヘルス
ある解決処理がこのリリースのツリーを読み、依存関係はありませんでした。欠落ではなく測定結果です。
最近の失敗クラスター
-
観測済み PROJECT_COMPILE exit 101 E0599 ×2 0.1.28 os=linux sha256:40827ed62704…error[E0599]: no method named `is_none` found for tuple `(u64, u64, addr2line::Location<'_>)` in the current scoperust/rustc · compiler-diagnostic · outer cargo run証拠品質: complete · 環境バリアント: 1 · 初回記録: 2026-09-19 · 最終観測: 2026-09-19
-
観測済み PROJECT_COMPILE exit 101 E0631 ×1 0.1.28 os=linux sha256:08581f58869b…error[E0631]: type mismatch in closure argumentsrust/rustc · compiler-diagnostic · outer cargo run証拠品質: complete · 環境バリアント: 1 · 初回記録: 2026-09-19 · 最終観測: 2026-09-19
-
観測済み PROJECT_COMPILE exit 101 ×1 0.1.28 os=linux sha256:7e12f411f813…error: could not compile `test_addr2line` (bin <str>) due to 1 previous errorrust/rustc · compiler-diagnostic · outer cargo run証拠品質: complete · 環境バリアント: 1 · 初回記録: 2026-09-19 · 最終観測: 2026-09-19
-
観測済み PROJECT_COMPILE exit 101 ×1 0.1.28 os=linux sha256:9d9b6169d6bd…error: could not compile `test_addr2line` (bin <str>) due to 9 previous errorsrust/rustc · compiler-diagnostic · outer cargo run証拠品質: complete · 環境バリアント: 1 · 初回記録: 2026-09-19 · 最終観測: 2026-09-19
-
観測済み PROJECT_COMPILE exit 101 E0063 ×1 0.1.28 os=linux sha256:b4d73c642e61…error[E0063]: missing fields `debug_macinfo` and `debug_macro` in initializer of `Dwarf<_>`rust/rustc · compiler-diagnostic · outer cargo run証拠品質: complete · 環境バリアント: 1 · 初回記録: 2026-09-19 · 最終観測: 2026-09-19
-
観測済み PROJECT_COMPILE exit 101 ×1 0.1.28 os=linux sha256:b7e6301755e9…error: could not compile `test-bt` (bin <str>) due to 2 previous errorsrust/rustc · compiler-diagnostic · outer cargo run証拠品質: complete · 環境バリアント: 1 · 初回記録: 2026-09-19 · 最終観測: 2026-09-19
-
観測済み PROJECT_COMPILE exit 101 E0061 ×1 0.1.28 os=linux sha256:db7a3103c11e…error[E0061]: this function takes 2 arguments but 1 argument was suppliedrust/rustc · compiler-diagnostic · outer cargo run証拠品質: complete · 環境バリアント: 1 · 初回記録: 2026-09-19 · 最終観測: 2026-09-19
-
観測済み UNKNOWN signal ABORTED 証拠の欠落 ×1 0.1.28 os=linux sha256:b0a63bccc458…Compiling object v0.37.3 · Compiling libc v0.2.189 · Compiling adler2 v2.0.1 · Compiling gimli v0.32.3cargo · unclassified-diagnostic · outer cargo run · gap stage-unknown証拠品質: complete · 環境バリアント: 1 · 初回記録: 2026-09-20 · 最終観測: 2026-09-20診断再検証候補
-
観測済み UNKNOWN exit 101 証拠の欠落 ×1 0.1.28 os=linux sha256:c970c257481f…Compiling cfg-if v1.0.5 · Compiling simd-adler32 v0.3.10 · Compiling adler2 v2.0.1 · Compiling crc32fast v1.5.2cargo · unclassified-diagnostic · outer cargo run · gap stage-unknown証拠品質: complete · 環境バリアント: 1 · 初回記録: 2026-09-19 · 最終観測: 2026-09-19診断再検証候補