Relevéscargorustc-demangle0.1.28
Changer les conditions
Conditions actuelles
rustc-demangle @0.1.28ubuntu glibc · x64 · cargo 1
total du paquet, pas une API
0 sur 2 ont réussi
Vérifié — ce réseau a exécuté un contrat à cette coordonnée.
il y a un échantillon ici et notre exécution à cette coordonnée a échoué
- Observations de projets
- 26 / 34
- Vérifications de contrat
- 0 / 2
- Enregistrements d'usage
- 1
- Pairs rapporteurs indépendants
- 1
- Dernier enregistrement
- 2026-10-09
Preuves que vous pouvez ouvrir
Santé des dépendances
Une résolution a lu l'arbre de cette version et n'a trouvé aucune dépendance. C'est une mesure, pas une mesure manquante.
Clusters d'échecs récents
-
observé PROJECT_COMPILE exit 101 E0599 ×2 0.1.28 os=linux sha256:40827ed62704…error[E0599]: no method named `is_none` found for tuple `(u64, u64, addr2line::Location<'_>)` in the current scoperust/rustc · compiler-diagnostic · outer cargo runQualité de preuve: complete · Variantes d’environnement: 1 · Premier relevé: 2026-09-19 · Dernière observation: 2026-09-19
-
observé PROJECT_COMPILE exit 101 E0631 ×1 0.1.28 os=linux sha256:08581f58869b…error[E0631]: type mismatch in closure argumentsrust/rustc · compiler-diagnostic · outer cargo runQualité de preuve: complete · Variantes d’environnement: 1 · Premier relevé: 2026-09-19 · Dernière observation: 2026-09-19
-
observé PROJECT_COMPILE exit 101 ×1 0.1.28 os=linux sha256:7e12f411f813…error: could not compile `test_addr2line` (bin <str>) due to 1 previous errorrust/rustc · compiler-diagnostic · outer cargo runQualité de preuve: complete · Variantes d’environnement: 1 · Premier relevé: 2026-09-19 · Dernière observation: 2026-09-19
-
observé PROJECT_COMPILE exit 101 ×1 0.1.28 os=linux sha256:9d9b6169d6bd…error: could not compile `test_addr2line` (bin <str>) due to 9 previous errorsrust/rustc · compiler-diagnostic · outer cargo runQualité de preuve: complete · Variantes d’environnement: 1 · Premier relevé: 2026-09-19 · Dernière observation: 2026-09-19
-
observé PROJECT_COMPILE exit 101 E0063 ×1 0.1.28 os=linux sha256:b4d73c642e61…error[E0063]: missing fields `debug_macinfo` and `debug_macro` in initializer of `Dwarf<_>`rust/rustc · compiler-diagnostic · outer cargo runQualité de preuve: complete · Variantes d’environnement: 1 · Premier relevé: 2026-09-19 · Dernière observation: 2026-09-19
-
observé PROJECT_COMPILE exit 101 ×1 0.1.28 os=linux sha256:b7e6301755e9…error: could not compile `test-bt` (bin <str>) due to 2 previous errorsrust/rustc · compiler-diagnostic · outer cargo runQualité de preuve: complete · Variantes d’environnement: 1 · Premier relevé: 2026-09-19 · Dernière observation: 2026-09-19
-
observé PROJECT_COMPILE exit 101 E0061 ×1 0.1.28 os=linux sha256:db7a3103c11e…error[E0061]: this function takes 2 arguments but 1 argument was suppliedrust/rustc · compiler-diagnostic · outer cargo runQualité de preuve: complete · Variantes d’environnement: 1 · Premier relevé: 2026-09-19 · Dernière observation: 2026-09-19
-
observé UNKNOWN signal ABORTED Lacune de preuve ×1 0.1.28 os=linux sha256:b0a63bccc458…Compiling object v0.37.3 · Compiling libc v0.2.189 · Compiling adler2 v2.0.1 · Compiling gimli v0.32.3cargo · unclassified-diagnostic · outer cargo run · gap stage-unknownQualité de preuve: complete · Variantes d’environnement: 1 · Premier relevé: 2026-09-20 · Dernière observation: 2026-09-20Candidat à une revérification diagnostique
-
observé UNKNOWN exit 101 Lacune de preuve ×1 0.1.28 os=linux sha256:c970c257481f…Compiling cfg-if v1.0.5 · Compiling simd-adler32 v0.3.10 · Compiling adler2 v2.0.1 · Compiling crc32fast v1.5.2cargo · unclassified-diagnostic · outer cargo run · gap stage-unknownQualité de preuve: complete · Variantes d’environnement: 1 · Premier relevé: 2026-09-19 · Dernière observation: 2026-09-19Candidat à une revérification diagnostique