记录cargoonce_cell1.21.4OnceLock::get_or_init
已发布的示例
- once_cell 1.21.4: Decide what still needs once_cell now that std has OnceLock, LazyLock, cell::OnceCell and cell::LazyCell, by measuring which once_cell APIs have a stable std equivalent on this rustc and which are still gated 本网络只提供一件事:能构建的样本。它在沙箱中运行并保留签名回执。它不评级、不担保——同样的代码能否在你的环境构建,它没有测量过。 MIGRATIONstd::sync::OnceLockOnceLock::setOnceLock::get_or_initOnceLock::takestd::sync::LazyLockLazyLock::forceLazyLock::force_mutstd::cell::OnceCellstd::cell::LazyCellonce_cell::sync::OnceCellonce_cell::sync::OnceCell::get_or_try_initonce_cell::sync::Lazyonce_cell::unsync::OnceCellrust 1 MIT-0 · 2026-08-14
兼容性矩阵
项目级观测与符号/契约验证分别统计,绝不合并。
这些计数不区分符号的调用方式:重载、参数形态和选项被合并统计。某一具体调用方式的行为由样本的契约证明,而不是由这些数字证明。
| 环境 | 置信度 | 观测 | 验证 | 通过率 | 节点 | 最近观测 |
|---|---|---|---|---|---|---|
| rust 1 · Rust · cargo · linux musl · docker
验证: CONTRACT 1✓
|
LOW | 0 | 1 | 100% | 0 · 1✓ | 2026-08-18 |
snapshot · 2026-09-15
失败聚类
-
已观测 PROJECT_COMPILE exit 101 E0507 ×1 1.21.4 os=linux sha256:4488bf5be6d6…error[E0507]: cannot move out of static item `FIELD_SET`rust/rustc · compiler-diagnostic · outer cargo run证据质量: complete · 环境变体: 1 · 首次记录: 2026-09-16 · 最近观测: 2026-09-16
-
已观测 PROJECT_COMPILE exit 101 ×1 1.21.4 os=linux sha256:7641f360237b…error: could not compile `sample-tracing-core` (bin <str>) due to 1 previous errorrust/rustc · compiler-diagnostic · outer cargo run证据质量: complete · 环境变体: 1 · 首次记录: 2026-09-16 · 最近观测: 2026-09-16
-
已观测 UNKNOWN exit 101 ERROR 证据缺口 ×1 1.21.4 os=linux sha256:7c6fafa6a835…Compiling sample-tracing-core v1.0.0 (<path> · Finished `dev` profile [unoptimized + debuginfo] target(s) in 0.21s · Running `target/debug/contract` …cargo · unclassified-diagnostic · outer cargo run · gap stage-unknown证据质量: complete · 环境变体: 1 · 首次记录: 2026-09-16 · 最近观测: 2026-09-16诊断复验候选
-
已观测 PROJECT_COMPILE exit 101 ×1 1.21.4 os=linux sha256:4d444e9e07b5…error: could not compile `test-wb` (bin <str>) due to 1 previous errorrust/rustc · compiler-diagnostic · outer cargo check证据质量: complete · 环境变体: 1 · 首次记录: 2026-09-19 · 最近观测: 2026-09-19
-
已观测 PROJECT_COMPILE exit 101 E0599 ×1 1.21.4 os=linux sha256:689d8da7053d…error[E0599]: no method named `http1_only` found for mutable reference `&mut hyper_util::client::legacy::Builder` in the current scoperust/rustc · compiler-diagnostic · outer cargo run证据质量: complete · 环境变体: 1 · 首次记录: 2026-09-19 · 最近观测: 2026-09-19
-
已观测 PROJECT_COMPILE exit 101 E0432 ×1 1.21.4 os=linux sha256:81ff5a6ae827…error[E0432]: unresolved import `wasm_bindgen_macro`rust/rustc · compiler-diagnostic · outer cargo check证据质量: complete · 环境变体: 1 · 首次记录: 2026-09-19 · 最近观测: 2026-09-19
-
已观测 PROJECT_COMPILE exit 101 E0433 ×1 1.21.4 os=linux sha256:8d7d824b0493…error[E0433]: cannot find module or crate `wasm_bindgen` in this scoperust/rustc · compiler-diagnostic · outer cargo check证据质量: complete · 环境变体: 1 · 首次记录: 2026-09-19 · 最近观测: 2026-09-19
-
已观测 PROJECT_COMPILE exit 101 ×1 1.21.4 os=linux sha256:a67fd218023f…error: could not compile `test-hyper-util` (bin <str>) due to 1 previous errorrust/rustc · compiler-diagnostic · outer cargo run证据质量: complete · 环境变体: 1 · 首次记录: 2026-09-19 · 最近观测: 2026-09-19
-
已观测 PROJECT_COMPILE exit 101 ×1 1.21.4 os=linux sha256:d0b315730521…error: could not compile `test-macro` (bin <str>) due to 1 previous errorrust/rustc · compiler-diagnostic · outer cargo check证据质量: complete · 环境变体: 1 · 首次记录: 2026-09-19 · 最近观测: 2026-09-19
-
已观测 UNKNOWN signal ABORTED 证据缺口 ×1 1.21.4 os=linux sha256:5650faa5dc98…Finished `dev` profile [unoptimized + debuginfo] target(s) in 0.02s · Running `target/debug/test-js-sys` …cargo · unclassified-diagnostic · outer cargo run · gap stage-unknown证据质量: complete · 环境变体: 1 · 首次记录: 2026-09-19 · 最近观测: 2026-09-19诊断复验候选
-
已观测 UNKNOWN exit 101 证据缺口 ×1 1.21.4 os=linux sha256:7714306cce9e…Compiling unicode-ident v1.0.26 · Compiling cfg-if v1.0.5 · Compiling once_cell v1.21.4 · Compiling proc-macro2 v1.0.107cargo · unclassified-diagnostic · outer cargo run · gap stage-unknown证据质量: complete · 环境变体: 1 · 首次记录: 2026-09-19 · 最近观测: 2026-09-19诊断复验候选
-
已观测 UNKNOWN exit 101 证据缺口 ×1 1.21.4 os=linux sha256:c6c5fb2b7e90…Compiling test_wb v0.1.0 (<path> · Finished `dev` profile [unoptimized + debuginfo] target(s) in 0.18s · Running `target/debug/test_wb` …cargo · unclassified-diagnostic · outer cargo run · gap stage-unknown证据质量: complete · 环境变体: 1 · 首次记录: 2026-09-19 · 最近观测: 2026-09-19诊断复验候选
显示报告最多的 12 个。此坐标记录的失败聚类共 18 个。其余为单次报告。