Registroscargoonce_cell1.21.4OnceLock::get_or_init
Exemplos publicados
- once_cell 1.21.4: Decide what still needs once_cell now that std has OnceLock, LazyLock, cell::OnceCell and cell::LazyCell, by measuring which once_cell APIs have a stable std equivalent on this rustc and which are still gated Esta rede oferece uma coisa: uma amostra que compila. Ela a executou em um sandbox e guardou o recibo assinado. Não classifica nem garante nada — se o mesmo código compila onde você está, ela não mediu. MIGRATIONstd::sync::OnceLockOnceLock::setOnceLock::get_or_initOnceLock::takestd::sync::LazyLockLazyLock::forceLazyLock::force_mutstd::cell::OnceCellstd::cell::LazyCellonce_cell::sync::OnceCellonce_cell::sync::OnceCell::get_or_try_initonce_cell::sync::Lazyonce_cell::unsync::OnceCellrust 1 MIT-0 · 2026-08-14
Matriz de compatibilidade
Observações no nível do projeto e verificações de símbolo/contrato são contadas separadamente e nunca somadas.
Estas contagens não distinguem como o símbolo foi chamado: sobrecargas, formatos de argumentos e opções são agrupados. O que uma forma de chamada específica faz é provado pelo contrato de uma amostra, não por estes números.
| Ambiente | Confiança | Observações | Verificado | Taxa de aprovação | Peers | Visto por último |
|---|---|---|---|---|---|---|
| rust 1 · Rust · cargo · linux musl · docker
Verificado: CONTRACT 1✓
|
LOW | 0 | 1 | 100% | 0 · 1✓ | 2026-08-18 |
snapshot · 2026-09-15
Clusters de falha
-
observado PROJECT_COMPILE exit 101 E0507 ×1 1.21.4 os=linux sha256:4488bf5be6d6…error[E0507]: cannot move out of static item `FIELD_SET`rust/rustc · compiler-diagnostic · outer cargo runQualidade da evidência: complete · Variantes de ambiente: 1 · Primeiro registro: 2026-09-16 · Visto por último: 2026-09-16
-
observado PROJECT_COMPILE exit 101 ×1 1.21.4 os=linux sha256:7641f360237b…error: could not compile `sample-tracing-core` (bin <str>) due to 1 previous errorrust/rustc · compiler-diagnostic · outer cargo runQualidade da evidência: complete · Variantes de ambiente: 1 · Primeiro registro: 2026-09-16 · Visto por último: 2026-09-16
-
observado UNKNOWN exit 101 ERROR Lacuna de evidência ×1 1.21.4 os=linux sha256:7c6fafa6a835…Compiling sample-tracing-core v1.0.0 (<path> · Finished `dev` profile [unoptimized + debuginfo] target(s) in 0.21s · Running `target/debug/contract` …cargo · unclassified-diagnostic · outer cargo run · gap stage-unknownQualidade da evidência: complete · Variantes de ambiente: 1 · Primeiro registro: 2026-09-16 · Visto por último: 2026-09-16Candidato a reverificação diagnóstica
-
observado PROJECT_COMPILE exit 101 ×1 1.21.4 os=linux sha256:4d444e9e07b5…error: could not compile `test-wb` (bin <str>) due to 1 previous errorrust/rustc · compiler-diagnostic · outer cargo checkQualidade da evidência: complete · Variantes de ambiente: 1 · Primeiro registro: 2026-09-19 · Visto por último: 2026-09-19
-
observado PROJECT_COMPILE exit 101 E0599 ×1 1.21.4 os=linux sha256:689d8da7053d…error[E0599]: no method named `http1_only` found for mutable reference `&mut hyper_util::client::legacy::Builder` in the current scoperust/rustc · compiler-diagnostic · outer cargo runQualidade da evidência: complete · Variantes de ambiente: 1 · Primeiro registro: 2026-09-19 · Visto por último: 2026-09-19
-
observado PROJECT_COMPILE exit 101 E0432 ×1 1.21.4 os=linux sha256:81ff5a6ae827…error[E0432]: unresolved import `wasm_bindgen_macro`rust/rustc · compiler-diagnostic · outer cargo checkQualidade da evidência: complete · Variantes de ambiente: 1 · Primeiro registro: 2026-09-19 · Visto por último: 2026-09-19
-
observado PROJECT_COMPILE exit 101 E0433 ×1 1.21.4 os=linux sha256:8d7d824b0493…error[E0433]: cannot find module or crate `wasm_bindgen` in this scoperust/rustc · compiler-diagnostic · outer cargo checkQualidade da evidência: complete · Variantes de ambiente: 1 · Primeiro registro: 2026-09-19 · Visto por último: 2026-09-19
-
observado PROJECT_COMPILE exit 101 ×1 1.21.4 os=linux sha256:a67fd218023f…error: could not compile `test-hyper-util` (bin <str>) due to 1 previous errorrust/rustc · compiler-diagnostic · outer cargo runQualidade da evidência: complete · Variantes de ambiente: 1 · Primeiro registro: 2026-09-19 · Visto por último: 2026-09-19
-
observado PROJECT_COMPILE exit 101 ×1 1.21.4 os=linux sha256:d0b315730521…error: could not compile `test-macro` (bin <str>) due to 1 previous errorrust/rustc · compiler-diagnostic · outer cargo checkQualidade da evidência: complete · Variantes de ambiente: 1 · Primeiro registro: 2026-09-19 · Visto por último: 2026-09-19
-
observado UNKNOWN signal ABORTED Lacuna de evidência ×1 1.21.4 os=linux sha256:5650faa5dc98…Finished `dev` profile [unoptimized + debuginfo] target(s) in 0.02s · Running `target/debug/test-js-sys` …cargo · unclassified-diagnostic · outer cargo run · gap stage-unknownQualidade da evidência: complete · Variantes de ambiente: 1 · Primeiro registro: 2026-09-19 · Visto por último: 2026-09-19Candidato a reverificação diagnóstica
-
observado UNKNOWN exit 101 Lacuna de evidência ×1 1.21.4 os=linux sha256:7714306cce9e…Compiling unicode-ident v1.0.26 · Compiling cfg-if v1.0.5 · Compiling once_cell v1.21.4 · Compiling proc-macro2 v1.0.107cargo · unclassified-diagnostic · outer cargo run · gap stage-unknownQualidade da evidência: complete · Variantes de ambiente: 1 · Primeiro registro: 2026-09-19 · Visto por último: 2026-09-19Candidato a reverificação diagnóstica
-
observado UNKNOWN exit 101 Lacuna de evidência ×1 1.21.4 os=linux sha256:c6c5fb2b7e90…Compiling test_wb v0.1.0 (<path> · Finished `dev` profile [unoptimized + debuginfo] target(s) in 0.18s · Running `target/debug/test_wb` …cargo · unclassified-diagnostic · outer cargo run · gap stage-unknownQualidade da evidência: complete · Variantes de ambiente: 1 · Primeiro registro: 2026-09-19 · Visto por último: 2026-09-19Candidato a reverificação diagnóstica
Mostrando os 12 mais relatados de 18 grupos de falhas registrados. O resto são relatos únicos.