Registroscargolibc0.2.191
Detalle del entorno
Las observaciones a nivel de proyecto y las verificaciones de símbolo/contrato se cuentan por separado y nunca se combinan.
Estos recuentos no distinguen cómo se llamó al símbolo: las sobrecargas, las formas de los argumentos y las opciones se agrupan. Lo que hace una forma de llamada concreta lo demuestra el contrato de una muestra, no estas cifras.
| Entorno | Confianza | Observaciones | Verificado | Tasa de éxito | Pares | Última observación |
|---|---|---|---|---|---|---|
| unknown · Rust · cargo · linux glibc
Observaciones: PROJECT_COMPILE 1✓ 5✕ · PROJECT_PROCESS 9✓ · PROJECT_TEST 5✓ 3✕
|
ELEVATED FAILURE | 23 | 0 | 65% | 1 | 2026-10-20 |
Clústeres de fallos recientes
-
observado PROJECT_TEST exit 101 ×2 0.2.191 os=linux sha256:4f232600c5a8…error: test failed, to rerun pass `--test contract` · running 0 tests …rust/test · test-runner-diagnostic · outer cargo testCalidad de evidencia: complete · Variantes de entorno: 1 · Primer registro: 2026-10-20 · Última observación: 2026-10-20
-
observado PROJECT_COMPILE exit 101 ×1 0.2.191 os=linux sha256:aaf1990e27c5…error: could not compile `sample-addr2line` (test <str>) due to 2 previous errors …rust/rustc · compiler-diagnostic · outer cargo testCalidad de evidencia: complete · Variantes de entorno: 1 · Primer registro: 2026-10-19 · Última observación: 2026-10-19
-
observado PROJECT_COMPILE exit 101 E0432 ×1 0.2.191 os=linux sha256:ac7324fdd333…error[E0432]: unresolved import `addr2line::object`rust/rustc · compiler-diagnostic · outer cargo testCalidad de evidencia: complete · Variantes de entorno: 1 · Primer registro: 2026-10-19 · Última observación: 2026-10-19
-
observado PROJECT_COMPILE exit 101 E0599 ×1 0.2.191 os=linux sha256:ff95f88fed26…error[E0599]: no associated function or constant named `new` found for struct `addr2line::Context<R>` in the current scoperust/rustc · compiler-diagnostic · outer cargo testCalidad de evidencia: complete · Variantes de entorno: 1 · Primer registro: 2026-10-19 · Última observación: 2026-10-19
-
observado PROJECT_TEST exit 101 E0432 ×1 0.2.191 os=linux sha256:c4faf3580ad8…34 | let ctx = Context::new(&obj_file).expect(<str>); · | ^^^ associated function or constant not found in `addr2line::Context<_>` · | …rust/test · test-runner-diagnostic · outer cargo testCalidad de evidencia: complete · Variantes de entorno: 1 · Primer registro: 2026-10-19 · Última observación: 2026-10-19
-
observado PROJECT_COMPILE exit 101 E0308 ×1 0.2.191 os=linux sha256:0479254218ac…error[E0308]: mismatched typesrust/rustc · compiler-diagnostic · outer cargo runCalidad de evidencia: complete · Variantes de entorno: 1 · Primer registro: 2026-10-19 · Última observación: 2026-10-19
-
observado PROJECT_COMPILE exit 101 ×1 0.2.191 os=linux sha256:4c786cbbce8a…error: could not compile `sample` (bin <str>) due to 1 previous errorrust/rustc · compiler-diagnostic · outer cargo runCalidad de evidencia: complete · Variantes de entorno: 1 · Primer registro: 2026-10-19 · Última observación: 2026-10-19
Símbolos
Aún no hay símbolos con evidencia.