Aufzeichnungencargolibc0.2.191
Umgebungsdetails
Beobachtungen auf Projektebene und Symbol-/Contract-Verifizierungen werden getrennt gezählt und niemals zusammengerechnet.
Diese Zahlen unterscheiden nicht, wie das Symbol aufgerufen wurde: Überladungen, Argumentformen und Optionen werden zusammengefasst. Was eine bestimmte Aufrufform tut, beweist der Vertrag eines Samples – nicht diese Zahlen.
| Umgebung | Konfidenz | Beobachtungen | Verifiziert | Erfolgsquote | Peers | Zuletzt gesehen |
|---|---|---|---|---|---|---|
| unknown · Rust · cargo · linux glibc
Beobachtungen: PROJECT_COMPILE 1✓ 5✕ · PROJECT_PROCESS 9✓ · PROJECT_TEST 5✓ 3✕
|
ELEVATED FAILURE | 23 | 0 | 65 % | 1 | 2026-10-20 |
Aktuelle Fehler-Cluster
-
beobachtet PROJECT_TEST exit 101 ×2 0.2.191 os=linux sha256:4f232600c5a8…error: test failed, to rerun pass `--test contract` · running 0 tests …rust/test · test-runner-diagnostic · outer cargo testBeweisqualität: complete · Umgebungsvarianten: 1 · Zuerst erfasst: 2026-10-20 · Zuletzt gesehen: 2026-10-20
-
beobachtet PROJECT_COMPILE exit 101 ×1 0.2.191 os=linux sha256:aaf1990e27c5…error: could not compile `sample-addr2line` (test <str>) due to 2 previous errors …rust/rustc · compiler-diagnostic · outer cargo testBeweisqualität: complete · Umgebungsvarianten: 1 · Zuerst erfasst: 2026-10-19 · Zuletzt gesehen: 2026-10-19
-
beobachtet PROJECT_COMPILE exit 101 E0432 ×1 0.2.191 os=linux sha256:ac7324fdd333…error[E0432]: unresolved import `addr2line::object`rust/rustc · compiler-diagnostic · outer cargo testBeweisqualität: complete · Umgebungsvarianten: 1 · Zuerst erfasst: 2026-10-19 · Zuletzt gesehen: 2026-10-19
-
beobachtet PROJECT_COMPILE exit 101 E0599 ×1 0.2.191 os=linux sha256:ff95f88fed26…error[E0599]: no associated function or constant named `new` found for struct `addr2line::Context<R>` in the current scoperust/rustc · compiler-diagnostic · outer cargo testBeweisqualität: complete · Umgebungsvarianten: 1 · Zuerst erfasst: 2026-10-19 · Zuletzt gesehen: 2026-10-19
-
beobachtet PROJECT_TEST exit 101 E0432 ×1 0.2.191 os=linux sha256:c4faf3580ad8…34 | let ctx = Context::new(&obj_file).expect(<str>); · | ^^^ associated function or constant not found in `addr2line::Context<_>` · | …rust/test · test-runner-diagnostic · outer cargo testBeweisqualität: complete · Umgebungsvarianten: 1 · Zuerst erfasst: 2026-10-19 · Zuletzt gesehen: 2026-10-19
-
beobachtet PROJECT_COMPILE exit 101 E0308 ×1 0.2.191 os=linux sha256:0479254218ac…error[E0308]: mismatched typesrust/rustc · compiler-diagnostic · outer cargo runBeweisqualität: complete · Umgebungsvarianten: 1 · Zuerst erfasst: 2026-10-19 · Zuletzt gesehen: 2026-10-19
-
beobachtet PROJECT_COMPILE exit 101 ×1 0.2.191 os=linux sha256:4c786cbbce8a…error: could not compile `sample` (bin <str>) due to 1 previous errorrust/rustc · compiler-diagnostic · outer cargo runBeweisqualität: complete · Umgebungsvarianten: 1 · Zuerst erfasst: 2026-10-19 · Zuletzt gesehen: 2026-10-19
Symbole
Noch keine Symbole mit Evidenz.