记录cargofutures-core0.3.34
哪个符号在哪里跑过
此版本的符号 × 操作系统。单元格可钻入该包的兼容性立方体。
1○ 12026-09-17
如何阅读单元格: 数字是该比率所依据的已记录观测次数——一次构建每到达一个阶段就留下一条观测,因此它既不是构建数,也不是机器数或人数。旁边的文档是另一个来源不同的事实:该坐标是否有样例,以及我们在那里运行它的结果。
- 该坐标还没有样例
- 有样例 — 我们尚未在该坐标运行过它
- 有样例 — 我们在该坐标运行过,并且干净地结束
- 有样例 — 我们在该坐标运行过,并且失败了
- 有样例 — 该坐标同时记录了通过的和失败的运行
- 没有记录 — 未知,既非“可用”也非“损坏”
- 这一格下面还有层级 — 点击打开
有文档,就说明该坐标有样例。样例是否存在,是关于这个版本和这个 API 的事实,不随操作系统、运行时或包管理器改变;颜色说的是它在你正在看的那个环境里跑得怎么样。
环境详情
项目级观测与符号/契约验证分别统计,绝不合并。
这些计数不区分符号的调用方式:重载、参数形态和选项被合并统计。某一具体调用方式的行为由样本的契约证明,而不是由这些数字证明。
| 环境 | 置信度 | 观测 | 验证 | 通过率 | 节点 | 最近观测 |
|---|---|---|---|---|---|---|
| unknown · Rust · cargo · linux glibc
观测: PROJECT_COMPILE 2✓ 5✕ · PROJECT_PROCESS 2✓ — 使用: USED 2✓
|
ELEVATED FAILURE | 9 +2 | 0 | 44% | 1 | 2026-09-15 |
| rust 1 · Rust · cargo · linux musl · docker
观测: PROJECT_LOAD 2✓ · PROJECT_TEST 2✓ — 使用: USED 2✓ — 验证: CONTRACT 2✓
|
LOW | 4 +2 | 2 | 100% | 1 · 1✓ | 2026-09-17 |
近期失败聚类
-
已观测 PROJECT_COMPILE exit 101 E0277 ×1 0.3.34 os=linux futures_core sha256:079d54d4b2e3…error[E0277]: `T` cannot be unpinned · error[E0277]: `E` cannot be unpinnedrust/rustc · compiler-diagnostic · outer cargo run证据质量: complete · 环境变体: 1 · 首次记录: 2026-09-15 · 最近观测: 2026-09-15
-
已观测 PROJECT_COMPILE exit 101 E0596 ×1 0.3.34 os=linux futures_core sha256:543987e39480…error[E0596]: cannot borrow data in dereference of `Pin<&mut ReadyTryFuture<T, E>>` as mutablerust/rustc · compiler-diagnostic · outer cargo run证据质量: complete · 环境变体: 1 · 首次记录: 2026-09-15 · 最近观测: 2026-09-15
-
已观测 PROJECT_COMPILE exit 101 E0119 ×1 0.3.34 os=linux futures_core sha256:5fe0d0b2f0ce…error[E0119]: conflicting implementations of trait `TryFuture` for type `ReadyTryFuture<_, _>`rust/rustc · compiler-diagnostic · outer cargo run证据质量: complete · 环境变体: 1 · 首次记录: 2026-09-15 · 最近观测: 2026-09-15
-
已观测 PROJECT_COMPILE exit 101 ×1 0.3.34 os=linux futures_core sha256:8f6f2276b3f1…error: could not compile `sample-futures-core` (bin <str>) due to 2 previous errors; 1 warning emittedrust/rustc · compiler-diagnostic · outer cargo run证据质量: complete · 环境变体: 1 · 首次记录: 2026-09-15 · 最近观测: 2026-09-15
-
已观测 PROJECT_COMPILE exit 101 ×1 0.3.34 os=linux futures_core sha256:e3dee1f39a56…error: could not compile `sample-futures-core` (bin <str>) due to 2 previous errorsrust/rustc · compiler-diagnostic · outer cargo run证据质量: complete · 环境变体: 1 · 首次记录: 2026-09-15 · 最近观测: 2026-09-15
符号
- futures_core 1 1/1 次通过
已发布的示例
- futures-core 0.3.34 本网络只提供一件事:能构建的样本。它在沙箱中运行并保留签名回执。它不评级、不担保——同样的代码能否在你的环境构建,它没有测量过。 HOW MIT-0 · 2026-09-15