Записиcargofutures-core0.3.34
Какой символ где выполнялся
Символы × операционные системы для этой версии. Ячейки ведут в куб совместимости пакета.
Как читать ячейку: Число — это записанные наблюдения, на которые делится доля: одна сборка оставляет по наблюдению на каждый достигнутый этап, поэтому это не число сборок, не число машин и не число людей. Документ рядом — другой факт из другого источника: есть ли в этой координате образец и чем закончился наш запуск его там.
- в этой координате образца пока нет
- образец есть — в этой координате мы его ещё не запускали
- образец есть — наш запуск в этой координате завершился чисто
- образец есть — наш запуск в этой координате не прошёл
- образец есть — в этой координате записаны и успешный, и неуспешный запуск
- ничего не записано — неизвестно, а не «работает» и не «сломано»
- под этой ячейкой есть уровень — нажмите, чтобы открыть
Документ означает, что в этой координате есть образец. Его НАЛИЧИЕ — это факт об этой версии и этом API, оно не меняется от ОС, среды выполнения или пакетного менеджера; ЦВЕТ говорит, как этот образец отработал в том окружении, которое вы сейчас смотрите.
Детали окружения
Наблюдения уровня проекта и проверки символов/контрактов считаются раздельно и никогда не суммируются.
Эти числа не различают, как именно был вызван символ: перегрузки, наборы аргументов и опции считаются вместе. Что делает конкретная форма вызова, доказывает контракт образца, а не эти цифры.
| Окружение | Достоверность | Наблюдения | Проверено | Доля успешных | Пиры | Последнее наблюдение |
|---|---|---|---|---|---|---|
| unknown · Rust · cargo · linux glibc
Наблюдения: PROJECT_COMPILE 2✓ 5✕ · PROJECT_PROCESS 2✓ — Использование: USED 2✓
|
ELEVATED FAILURE | 9 +2 | 0 | 44 % | 1 | 2026-09-15 |
| rust 1 · Rust · cargo · linux musl · docker
Наблюдения: PROJECT_LOAD 2✓ · PROJECT_TEST 2✓ — Использование: USED 2✓ — Проверено: CONTRACT 2✓
|
LOW | 4 +2 | 2 | 100 % | 1 · 1✓ | 2026-09-17 |
Недавние кластеры сбоев
-
наблюдалось PROJECT_COMPILE exit 101 E0277 ×1 0.3.34 os=linux futures_core sha256:079d54d4b2e3…error[E0277]: `T` cannot be unpinned · error[E0277]: `E` cannot be unpinnedrust/rustc · compiler-diagnostic · outer cargo runКачество данных: complete · Варианты среды: 1 · Первая запись: 2026-09-15 · Последнее наблюдение: 2026-09-15
-
наблюдалось PROJECT_COMPILE exit 101 E0596 ×1 0.3.34 os=linux futures_core sha256:543987e39480…error[E0596]: cannot borrow data in dereference of `Pin<&mut ReadyTryFuture<T, E>>` as mutablerust/rustc · compiler-diagnostic · outer cargo runКачество данных: complete · Варианты среды: 1 · Первая запись: 2026-09-15 · Последнее наблюдение: 2026-09-15
-
наблюдалось PROJECT_COMPILE exit 101 E0119 ×1 0.3.34 os=linux futures_core sha256:5fe0d0b2f0ce…error[E0119]: conflicting implementations of trait `TryFuture` for type `ReadyTryFuture<_, _>`rust/rustc · compiler-diagnostic · outer cargo runКачество данных: complete · Варианты среды: 1 · Первая запись: 2026-09-15 · Последнее наблюдение: 2026-09-15
-
наблюдалось PROJECT_COMPILE exit 101 ×1 0.3.34 os=linux futures_core sha256:8f6f2276b3f1…error: could not compile `sample-futures-core` (bin <str>) due to 2 previous errors; 1 warning emittedrust/rustc · compiler-diagnostic · outer cargo runКачество данных: complete · Варианты среды: 1 · Первая запись: 2026-09-15 · Последнее наблюдение: 2026-09-15
-
наблюдалось PROJECT_COMPILE exit 101 ×1 0.3.34 os=linux futures_core sha256:e3dee1f39a56…error: could not compile `sample-futures-core` (bin <str>) due to 2 previous errorsrust/rustc · compiler-diagnostic · outer cargo runКачество данных: complete · Варианты среды: 1 · Первая запись: 2026-09-15 · Последнее наблюдение: 2026-09-15
Символы
- futures_core 1 пройдено 1 из 1 запусков
Опубликованные примеры
- futures-core 0.3.34 Эта сеть предлагает одно: образец, который собирается. Она запустила его в песочнице и сохранила подписанную квитанцию. Она ничего не оценивает и ничего не гарантирует — собирается ли тот же код у вас, она не измеряла. HOW MIT-0 · 2026-09-15