Записиcargocpp_demangle0.4.5
Изменить условия
Текущие условия
cpp_demangle @0.4.5ubuntu glibc · x64 · cargo 1
итог по пакету, а не API
0 из 1 прошли
Проверено — эта сеть выполнила контракт в этой координате.
образец есть — наш запуск в этой координате не прошёл
- Наблюдения в проектах
- 9 / 15
- Проверки контрактом
- 0 / 1
- Независимые сообщившие пиры
- 1
- Последняя запись
- 2026-09-19
Свидетельства, которые можно открыть
Здоровье зависимостей
Наблюдаемые комбинации и свидетельства сбоев для этого выпуска
Замечено проблем: 1 ·
Стабильно: 1
Первый обнаруженный сбой
0.4.5
linux
2 FAIL
· stage: PROJECT_COMPILE
· fingerprint: sha256:40827ed6270443985b87902d50b257ee40df217d061c0098b7070f9287145dc9
| Библиотека | Версия | Состояние | Измерено там | Проектов |
|---|---|---|---|---|
| cfg-if | 1.0.5 | PASS Все наблюдения прошли успешно | контракт пройден | 2 проектных дня |
Столбец измерения относится к релизу самой зависимости, а не к паре. То, что резолвер поставил два релиза рядом, не доказывает, что они работают вместе.
Недавние кластеры сбоев
-
наблюдалось PROJECT_COMPILE exit 101 E0599 ×2 0.4.5 os=linux sha256:40827ed62704…error[E0599]: no method named `is_none` found for tuple `(u64, u64, addr2line::Location<'_>)` in the current scoperust/rustc · compiler-diagnostic · outer cargo runКачество данных: complete · Варианты среды: 1 · Первая запись: 2026-09-19 · Последнее наблюдение: 2026-09-19
-
наблюдалось PROJECT_COMPILE exit 101 ×1 0.4.5 os=linux sha256:7e12f411f813…error: could not compile `test_addr2line` (bin <str>) due to 1 previous errorrust/rustc · compiler-diagnostic · outer cargo runКачество данных: complete · Варианты среды: 1 · Первая запись: 2026-09-19 · Последнее наблюдение: 2026-09-19
-
наблюдалось PROJECT_COMPILE exit 101 ×1 0.4.5 os=linux sha256:9d9b6169d6bd…error: could not compile `test_addr2line` (bin <str>) due to 9 previous errorsrust/rustc · compiler-diagnostic · outer cargo runКачество данных: complete · Варианты среды: 1 · Первая запись: 2026-09-19 · Последнее наблюдение: 2026-09-19
-
наблюдалось PROJECT_COMPILE exit 101 E0063 ×1 0.4.5 os=linux sha256:b4d73c642e61…error[E0063]: missing fields `debug_macinfo` and `debug_macro` in initializer of `Dwarf<_>`rust/rustc · compiler-diagnostic · outer cargo runКачество данных: complete · Варианты среды: 1 · Первая запись: 2026-09-19 · Последнее наблюдение: 2026-09-19
-
наблюдалось PROJECT_COMPILE exit 101 E0061 ×1 0.4.5 os=linux sha256:db7a3103c11e…error[E0061]: this function takes 2 arguments but 1 argument was suppliedrust/rustc · compiler-diagnostic · outer cargo runКачество данных: complete · Варианты среды: 1 · Первая запись: 2026-09-19 · Последнее наблюдение: 2026-09-19
-
наблюдалось UNKNOWN exit 101 Пробел в данных ×1 0.4.5 os=linux sha256:c970c257481f…Compiling cfg-if v1.0.5 · Compiling simd-adler32 v0.3.10 · Compiling adler2 v2.0.1 · Compiling crc32fast v1.5.2cargo · unclassified-diagnostic · outer cargo run · gap stage-unknownКачество данных: complete · Варианты среды: 1 · Первая запись: 2026-09-19 · Последнее наблюдение: 2026-09-19Кандидат на диагностическую перепроверку