記録cargocpp_demangle0.4.5
条件を変更
現在の条件
cpp_demangle @0.4.5ubuntu glibc · x64 · cargo 1
API ではなくパッケージ全体の合計
1 回中 0 回が成功
検証 — このネットワークがこの座標でコントラクトを実行しました。
サンプルあり — この座標で実行し、失敗した
- プロジェクト観測
- 9 / 15
- コントラクト検証
- 0 / 1
- 独立した報告ピア
- 1
- 最終記録
- 2026-09-19
開ける証拠
依存関係のヘルス
このリリースの依存関係の組み合わせと失敗観測
観測された問題 1件 ·
正常 1件
| ライブラリ | バージョン | ヘルス | その座標で測定されたこと | プロジェクト |
|---|---|---|---|---|
| cfg-if | 1.0.5 | PASS すべての観測で成功 | コントラクト合格 | プロジェクト日 2 件 |
測定列は各依存関係自身のリリースに関するもので、2つのリリースの組み合わせに関するものではありません。リゾルバが2つを並べたという事実は、両者が協調して動く証拠ではありません。
最近の失敗クラスター
-
観測済み PROJECT_COMPILE exit 101 E0599 ×2 0.4.5 os=linux sha256:40827ed62704…error[E0599]: no method named `is_none` found for tuple `(u64, u64, addr2line::Location<'_>)` in the current scoperust/rustc · compiler-diagnostic · outer cargo run証拠品質: complete · 環境バリアント: 1 · 初回記録: 2026-09-19 · 最終観測: 2026-09-19
-
観測済み PROJECT_COMPILE exit 101 ×1 0.4.5 os=linux sha256:7e12f411f813…error: could not compile `test_addr2line` (bin <str>) due to 1 previous errorrust/rustc · compiler-diagnostic · outer cargo run証拠品質: complete · 環境バリアント: 1 · 初回記録: 2026-09-19 · 最終観測: 2026-09-19
-
観測済み PROJECT_COMPILE exit 101 ×1 0.4.5 os=linux sha256:9d9b6169d6bd…error: could not compile `test_addr2line` (bin <str>) due to 9 previous errorsrust/rustc · compiler-diagnostic · outer cargo run証拠品質: complete · 環境バリアント: 1 · 初回記録: 2026-09-19 · 最終観測: 2026-09-19
-
観測済み PROJECT_COMPILE exit 101 E0063 ×1 0.4.5 os=linux sha256:b4d73c642e61…error[E0063]: missing fields `debug_macinfo` and `debug_macro` in initializer of `Dwarf<_>`rust/rustc · compiler-diagnostic · outer cargo run証拠品質: complete · 環境バリアント: 1 · 初回記録: 2026-09-19 · 最終観測: 2026-09-19
-
観測済み PROJECT_COMPILE exit 101 E0061 ×1 0.4.5 os=linux sha256:db7a3103c11e…error[E0061]: this function takes 2 arguments but 1 argument was suppliedrust/rustc · compiler-diagnostic · outer cargo run証拠品質: complete · 環境バリアント: 1 · 初回記録: 2026-09-19 · 最終観測: 2026-09-19
-
観測済み UNKNOWN exit 101 証拠の欠落 ×1 0.4.5 os=linux sha256:c970c257481f…Compiling cfg-if v1.0.5 · Compiling simd-adler32 v0.3.10 · Compiling adler2 v2.0.1 · Compiling crc32fast v1.5.2cargo · unclassified-diagnostic · outer cargo run · gap stage-unknown証拠品質: complete · 環境バリアント: 1 · 初回記録: 2026-09-19 · 最終観測: 2026-09-19診断再検証候補