Registrosnpmws8.21.3WebSocket
reivindicado por 2 pacotes — esta evidência não diz de quem é a API
OS × runtime em um relance
Como ler uma célula: O número são as observações registradas entre as quais a taxa divide — um build deixa uma observação por etapa que alcançou, então não conta builds, nem máquinas, nem pessoas. O documento ao lado é outro fato, de outra fonte: se existe uma amostra naquela coordenada e como foi a nossa execução dela ali.
- ainda sem amostra nesta coordenada
- há uma amostra aqui e ainda não a executamos nesta coordenada
- há uma amostra aqui e nossa execução nesta coordenada terminou limpa
- há uma amostra aqui e nossa execução nesta coordenada falhou
- há uma amostra aqui e esta coordenada registra ao mesmo tempo uma execução aprovada e uma reprovada
- nada registrado — desconhecido, nem “funciona” nem “quebrado”
- há um nível abaixo desta célula — clique para abrir
Um documento significa que há uma amostra naquela coordenada. Se ela EXISTE é um fato sobre esta versão e esta API e não muda com o sistema operacional, o runtime ou o gerenciador de pacotes; a COR diz como essa amostra rodou no ambiente que você está vendo.
Exemplos publicados
- ws 8.21.3: Distinguish ws package EventEmitter API and Buffer payloads from native WHATWG EventTarget WebSocket and string payloads in Node Esta rede oferece uma coisa: uma amostra que compila. Ela a executou em um sandbox e guardou o recibo assinado. Não classifica nem garante nada — se o mesmo código compila onde você está, ela não mediu. HOWWebSocketWebSocket.prototype.onWebSocket.prototype.pingWebSocket.prototype.binaryTypeWebSocketServernode MIT-0 · 2026-08-14
- ws 8.21.3: Run a WebSocket server and client round trip with ws Esta rede oferece uma coisa: uma amostra que compila. Ela a executou em um sandbox e guardou o recibo assinado. Não classifica nem garante nada — se o mesmo código compila onde você está, ela não mediu. HOWWebSocketServerWebSocketnode 22 MIT-0 · 2026-08-13
Matriz de compatibilidade
Observações no nível do projeto e verificações de símbolo/contrato são contadas separadamente e nunca somadas.
Estas contagens não distinguem como o símbolo foi chamado: sobrecargas, formatos de argumentos e opções são agrupados. O que uma forma de chamada específica faz é provado pelo contrato de uma amostra, não por estes números.
| Ambiente | Confiança | Observações | Verificado | Taxa de aprovação | Peers | Visto por último |
|---|---|---|---|---|---|---|
| node 22 · JS · npm · linux musl · docker
Observações: PROJECT_TEST 1✓ — Verificado: CONTRACT 2✓
|
MEDIUM | 1 | 2 | 100% | 1 · 2✓ | 2026-09-07 |
| node 22 · JS · npm · linux musl · docker
Observações: PROJECT_TEST 1✓ — Verificado: CONTRACT 2✓
|
MEDIUM | 1 | 2 | 100% | 1 · 2✓ | 2026-09-07 |
| node 24.13 · JS · npm · windows
Observações: PROJECT_PROCESS 1✓
|
LOW | 1 | 0 | 100% | 1 | 2026-08-13 |
snapshot · 2026-09-15
Clusters de falha
-
observado PROJECT_PROCESS ERR_ASSERTION Lacuna de evidência ×17 8.21.3 executionContext=nodeQualidade da evidência: legacy-evidence-incomplete · Variantes de ambiente: 3 · Primeiro registro: 2026-08-18 · Visto por último: 2026-08-27Candidato a reverificação diagnóstica
-
observado PROJECT_TEST ENOENT Lacuna de evidência ×2 8.21.1 → 8.21.3 executionContext=node · os=windows · runtime=node@24.13Qualidade da evidência: legacy-evidence-incomplete · Variantes de ambiente: 2 · Primeiro registro: 2026-08-18 · Visto por último: 2026-08-21Candidato a reverificação diagnóstica
-
observado UNKNOWN exit 1 ERR_ASSERTION Lacuna de evidência ×2 8.21.3 executionContext=node · moduleSystem=cjs · os=linux · runtime=node@22.23 sha256:deb29d18a641…Test failed: AssertionError [ERR_ASSERTION]: Expected values to be strictly equal: · + actual - expected · + <str> · - <str>node · unclassified-diagnostic · outer node · gap stage-unknownQualidade da evidência: complete · Variantes de ambiente: 1 · Primeiro registro: 2026-08-29 · Visto por último: 2026-08-29Candidato a reverificação diagnóstica
-
observado UNKNOWN exit 1 Lacuna de evidência ×2 8.21.3 executionContext=node · moduleSystem=cjs · os=linux · runtime=node@22.23 sha256:91ad26545eb1…node:internal/modules/cjs/loader:<n> · throw err; · ^ · Error: Cannot find module <str>node · unclassified-diagnostic · outer node · gap stage-unknownQualidade da evidência: complete · Variantes de ambiente: 1 · Primeiro registro: 2026-08-31 · Visto por último: 2026-08-31Candidato a reverificação diagnóstica
-
observado UNKNOWN exit 1 ERR_ASSERTION Lacuna de evidência ×2 8.21.3 executionContext=node · moduleSystem=esm · os=linux · runtime=node@22.23 sha256:986d98189e70…node:internal/modules/run_main:<n> · triggerUncaughtException( · ^ · AssertionError [ERR_ASSERTION]: Expected values to be strictly equal:node · unclassified-diagnostic · outer node · gap stage-unknownQualidade da evidência: complete · Variantes de ambiente: 1 · Primeiro registro: 2026-08-31 · Visto por último: 2026-08-31Candidato a reverificação diagnóstica
-
observado UNKNOWN exit 1 ERR_ASSERTION Lacuna de evidência ×1 8.21.3 executionContext=node · moduleSystem=cjs · os=linux · runtime=node@22.23 sha256:3ad0f21f8b08…Contract test failed: AssertionError [ERR_ASSERTION]: Expected values to be strictly equal: · + actual - expected · + <str> · - <str>node · unclassified-diagnostic · outer node · gap stage-unknownQualidade da evidência: complete · Variantes de ambiente: 1 · Primeiro registro: 2026-08-29 · Visto por último: 2026-08-29Candidato a reverificação diagnóstica
-
observado UNKNOWN exit 1 ERR_ASSERTION Lacuna de evidência ×1 8.21.3 executionContext=node · moduleSystem=esm · os=linux · runtime=node@22.23 sha256:c38a78d344c3…Contract verification failed: AssertionError [ERR_ASSERTION]: Expected values to be strictly equal: · + actual - expected · + [Function: createRoot$1] …node · unclassified-diagnostic · outer node · gap stage-unknownQualidade da evidência: complete · Variantes de ambiente: 1 · Primeiro registro: 2026-08-31 · Visto por último: 2026-08-31Candidato a reverificação diagnóstica
-
observado UNKNOWN exit 13 Lacuna de evidência ×1 8.21.3 executionContext=node · moduleSystem=esm · os=linux · runtime=node@22.23 sha256:039a342da574…Warning: Detected unsettled top-level await at <url> · await new Promise((resolve) => { · ^ · Testing JSDOM ResourceLoader capabilities...node · unclassified-diagnostic · outer node · gap stage-unknownQualidade da evidência: complete · Variantes de ambiente: 1 · Primeiro registro: 2026-08-31 · Visto por último: 2026-08-31Candidato a reverificação diagnóstica
-
observado UNKNOWN exit 1 ERR_ASSERTION Lacuna de evidência ×1 8.21.3 executionContext=node · moduleSystem=esm · os=linux · runtime=node@22.23 sha256:0aab47d72aec…node:internal/modules/run_main:<n> · triggerUncaughtException( · ^ …node · unclassified-diagnostic · outer node · gap stage-unknownQualidade da evidência: complete · Variantes de ambiente: 1 · Primeiro registro: 2026-08-31 · Visto por último: 2026-08-31Candidato a reverificação diagnóstica
-
observado UNKNOWN exit 13 Lacuna de evidência ×1 8.21.3 executionContext=node · moduleSystem=esm · os=linux · runtime=node@22.23 sha256:e05fc6863dbb…Warning: Detected unsettled top-level await at <url> · await new Promise((resolve) => { · ^ · Testing full ResourceLoader contract suite...node · unclassified-diagnostic · outer node · gap stage-unknownQualidade da evidência: complete · Variantes de ambiente: 1 · Primeiro registro: 2026-08-31 · Visto por último: 2026-08-31Candidato a reverificação diagnóstica
-
observado UNKNOWN exit 1 ERR_ASSERTION Lacuna de evidência ×1 8.21.3 executionContext=node · moduleSystem=esm · os=linux · runtime=node@22.23 sha256:e6dc9227296b…node:internal/modules/run_main:<n> · triggerUncaughtException( · ^ · AssertionError [ERR_ASSERTION]: Values have same structure but are not reference-equal:node · unclassified-diagnostic · outer node · gap stage-unknownQualidade da evidência: complete · Variantes de ambiente: 1 · Primeiro registro: 2026-08-31 · Visto por último: 2026-08-31Candidato a reverificação diagnóstica
-
observado UNKNOWN exit 1 Lacuna de evidência ×1 8.21.3 executionContext=node · moduleSystem=esm · os=linux · runtime=node@22.23 sha256:529aac3b1da7…<url> · globalThis.navigator = dom.window.navigator; · ^ · TypeError: Cannot set property navigator of #<Object> which has only a getternode · unclassified-diagnostic · outer node · gap stage-unknownQualidade da evidência: complete · Variantes de ambiente: 1 · Primeiro registro: 2026-09-12 · Visto por último: 2026-09-12Candidato a reverificação diagnóstica