Записиnpmws8.21.3WebSocket.prototype.binaryType
Опубликованные примеры
- ws 8.21.3: Distinguish ws package EventEmitter API and Buffer payloads from native WHATWG EventTarget WebSocket and string payloads in Node Эта сеть предлагает одно: образец, который собирается. Она запустила его в песочнице и сохранила подписанную квитанцию. Она ничего не оценивает и ничего не гарантирует — собирается ли тот же код у вас, она не измеряла. HOWWebSocketWebSocket.prototype.onWebSocket.prototype.pingWebSocket.prototype.binaryTypeWebSocketServernode MIT-0 · 2026-08-14
Матрица совместимости
Наблюдения уровня проекта и проверки символов/контрактов считаются раздельно и никогда не суммируются.
Эти числа не различают, как именно был вызван символ: перегрузки, наборы аргументов и опции считаются вместе. Что делает конкретная форма вызова, доказывает контракт образца, а не эти цифры.
| Окружение | Достоверность | Наблюдения | Проверено | Доля успешных | Пиры | Последнее наблюдение |
|---|---|---|---|---|---|---|
| node 22 · JS · npm · linux musl · docker
Наблюдения: PROJECT_TEST 1✓ — Проверено: CONTRACT 2✓
|
MEDIUM | 1 | 2 | 100 % | 1 · 2✓ | 2026-09-07 |
snapshot · 2026-09-15
Кластеры сбоев
-
наблюдалось PROJECT_PROCESS ERR_ASSERTION Пробел в данных ×17 8.21.3 executionContext=nodeКачество данных: legacy-evidence-incomplete · Варианты среды: 3 · Первая запись: 2026-08-18 · Последнее наблюдение: 2026-08-27Кандидат на диагностическую перепроверку
-
наблюдалось PROJECT_TEST ENOENT Пробел в данных ×2 8.21.1 → 8.21.3 executionContext=node · os=windows · runtime=node@24.13Качество данных: legacy-evidence-incomplete · Варианты среды: 2 · Первая запись: 2026-08-18 · Последнее наблюдение: 2026-08-21Кандидат на диагностическую перепроверку
-
наблюдалось UNKNOWN exit 1 ERR_ASSERTION Пробел в данных ×2 8.21.3 executionContext=node · moduleSystem=cjs · os=linux · runtime=node@22.23 sha256:deb29d18a641…Test failed: AssertionError [ERR_ASSERTION]: Expected values to be strictly equal: · + actual - expected · + <str> · - <str>node · unclassified-diagnostic · outer node · gap stage-unknownКачество данных: complete · Варианты среды: 1 · Первая запись: 2026-08-29 · Последнее наблюдение: 2026-08-29Кандидат на диагностическую перепроверку
-
наблюдалось UNKNOWN exit 1 Пробел в данных ×2 8.21.3 executionContext=node · moduleSystem=cjs · os=linux · runtime=node@22.23 sha256:91ad26545eb1…node:internal/modules/cjs/loader:<n> · throw err; · ^ · Error: Cannot find module <str>node · unclassified-diagnostic · outer node · gap stage-unknownКачество данных: complete · Варианты среды: 1 · Первая запись: 2026-08-31 · Последнее наблюдение: 2026-08-31Кандидат на диагностическую перепроверку
-
наблюдалось UNKNOWN exit 1 ERR_ASSERTION Пробел в данных ×2 8.21.3 executionContext=node · moduleSystem=esm · os=linux · runtime=node@22.23 sha256:986d98189e70…node:internal/modules/run_main:<n> · triggerUncaughtException( · ^ · AssertionError [ERR_ASSERTION]: Expected values to be strictly equal:node · unclassified-diagnostic · outer node · gap stage-unknownКачество данных: complete · Варианты среды: 1 · Первая запись: 2026-08-31 · Последнее наблюдение: 2026-08-31Кандидат на диагностическую перепроверку
-
наблюдалось UNKNOWN exit 1 ERR_ASSERTION Пробел в данных ×1 8.21.3 executionContext=node · moduleSystem=cjs · os=linux · runtime=node@22.23 sha256:3ad0f21f8b08…Contract test failed: AssertionError [ERR_ASSERTION]: Expected values to be strictly equal: · + actual - expected · + <str> · - <str>node · unclassified-diagnostic · outer node · gap stage-unknownКачество данных: complete · Варианты среды: 1 · Первая запись: 2026-08-29 · Последнее наблюдение: 2026-08-29Кандидат на диагностическую перепроверку
-
наблюдалось UNKNOWN exit 1 ERR_ASSERTION Пробел в данных ×1 8.21.3 executionContext=node · moduleSystem=esm · os=linux · runtime=node@22.23 sha256:c38a78d344c3…Contract verification failed: AssertionError [ERR_ASSERTION]: Expected values to be strictly equal: · + actual - expected · + [Function: createRoot$1] …node · unclassified-diagnostic · outer node · gap stage-unknownКачество данных: complete · Варианты среды: 1 · Первая запись: 2026-08-31 · Последнее наблюдение: 2026-08-31Кандидат на диагностическую перепроверку
-
наблюдалось UNKNOWN exit 13 Пробел в данных ×1 8.21.3 executionContext=node · moduleSystem=esm · os=linux · runtime=node@22.23 sha256:039a342da574…Warning: Detected unsettled top-level await at <url> · await new Promise((resolve) => { · ^ · Testing JSDOM ResourceLoader capabilities...node · unclassified-diagnostic · outer node · gap stage-unknownКачество данных: complete · Варианты среды: 1 · Первая запись: 2026-08-31 · Последнее наблюдение: 2026-08-31Кандидат на диагностическую перепроверку
-
наблюдалось UNKNOWN exit 1 ERR_ASSERTION Пробел в данных ×1 8.21.3 executionContext=node · moduleSystem=esm · os=linux · runtime=node@22.23 sha256:0aab47d72aec…node:internal/modules/run_main:<n> · triggerUncaughtException( · ^ …node · unclassified-diagnostic · outer node · gap stage-unknownКачество данных: complete · Варианты среды: 1 · Первая запись: 2026-08-31 · Последнее наблюдение: 2026-08-31Кандидат на диагностическую перепроверку
-
наблюдалось UNKNOWN exit 13 Пробел в данных ×1 8.21.3 executionContext=node · moduleSystem=esm · os=linux · runtime=node@22.23 sha256:e05fc6863dbb…Warning: Detected unsettled top-level await at <url> · await new Promise((resolve) => { · ^ · Testing full ResourceLoader contract suite...node · unclassified-diagnostic · outer node · gap stage-unknownКачество данных: complete · Варианты среды: 1 · Первая запись: 2026-08-31 · Последнее наблюдение: 2026-08-31Кандидат на диагностическую перепроверку
-
наблюдалось UNKNOWN exit 1 ERR_ASSERTION Пробел в данных ×1 8.21.3 executionContext=node · moduleSystem=esm · os=linux · runtime=node@22.23 sha256:e6dc9227296b…node:internal/modules/run_main:<n> · triggerUncaughtException( · ^ · AssertionError [ERR_ASSERTION]: Values have same structure but are not reference-equal:node · unclassified-diagnostic · outer node · gap stage-unknownКачество данных: complete · Варианты среды: 1 · Первая запись: 2026-08-31 · Последнее наблюдение: 2026-08-31Кандидат на диагностическую перепроверку
-
наблюдалось UNKNOWN exit 1 Пробел в данных ×1 8.21.3 executionContext=node · moduleSystem=esm · os=linux · runtime=node@22.23 sha256:529aac3b1da7…<url> · globalThis.navigator = dom.window.navigator; · ^ · TypeError: Cannot set property navigator of #<Object> which has only a getternode · unclassified-diagnostic · outer node · gap stage-unknownКачество данных: complete · Варианты среды: 1 · Первая запись: 2026-09-12 · Последнее наблюдение: 2026-09-12Кандидат на диагностическую перепроверку