Aufzeichnungennpmtype-fest0.21.3SetOptional
OS × Runtime auf einen Blick
Eine Zelle lesen: Die Zahl sind die aufgezeichneten Beobachtungen, durch die die Rate teilt — ein Build hinterlässt pro erreichter Stufe eine Beobachtung, also zählt sie weder Builds noch Maschinen noch Personen. Das Dokument daneben ist eine andere Tatsache aus einer anderen Quelle: ob an dieser Koordinate ein Sample existiert und wie unser eigener Lauf davon dort ausging.
- an dieser Koordinate noch kein Sample
- hier gibt es ein Sample, und wir haben es an dieser Koordinate noch nicht ausgeführt
- hier gibt es ein Sample, und unser Lauf an dieser Koordinate kam sauber zurück
- hier gibt es ein Sample, und unser Lauf an dieser Koordinate ist fehlgeschlagen
- hier gibt es ein Sample, und an dieser Koordinate sind ein bestandener und ein fehlgeschlagener Lauf verzeichnet
- nichts aufgezeichnet — unbekannt, weder „funktioniert“ noch „defekt“
- unter dieser Zelle liegt eine Ebene — zum Öffnen klicken
Ein Dokument bedeutet: An dieser Koordinate gibt es ein Sample. DASS es existiert, ist eine Aussage über diese Version und diese API und ändert sich nicht mit Betriebssystem, Runtime oder Paketmanager; seine FARBE sagt, wie dieses Sample in der Umgebung gelaufen ist, die Sie gerade ansehen.
Veröffentlichte Beispiele
- type-fest 0.21.3: Except, PackageJson, SetOptional Dieses Netzwerk bietet eine Sache: ein Sample, das baut. Es hat es in einer Sandbox ausgeführt und die signierte Quittung behalten. Es bewertet nichts und garantiert nichts — ob derselbe Code bei Ihnen baut, hat es nicht gemessen. HOWExceptPackageJsonSetOptional MIT-0 · 2026-08-26
Kompatibilitätsmatrix
Beobachtungen auf Projektebene und Symbol-/Contract-Verifizierungen werden getrennt gezählt und niemals zusammengerechnet.
Diese Zahlen unterscheiden nicht, wie das Symbol aufgerufen wurde: Überladungen, Argumentformen und Optionen werden zusammengefasst. Was eine bestimmte Aufrufform tut, beweist der Vertrag eines Samples – nicht diese Zahlen.
| Umgebung | Konfidenz | Beobachtungen | Verifiziert | Erfolgsquote | Peers | Zuletzt gesehen |
|---|---|---|---|---|---|---|
| node 22 · JS · npm · linux musl · docker
Verifiziert: CONTRACT 1✓
|
LOW | 0 | 1 | 100 % | 0 · 1✓ | 2026-08-26 |
| node 22 · JS · npm · linux glibc · docker
Beobachtungen: PROJECT_TEST 1✓ — Verifiziert: CONTRACT 1✓
|
LOW | 1 | 1 | 100 % | 1 · 1✓ | 2026-09-07 |
snapshot · 2026-09-15
Fehler-Cluster
-
beobachtet UNKNOWN exit 1 Beweislücke ×4 0.13.1 → 0.21.3 executionContext=node · moduleSystem=cjs · os=linux · runtime=node@22.23 sha256:91ad26545eb1…node:internal/modules/cjs/loader:<n> · throw err; · ^ · Error: Cannot find module <str>node · unclassified-diagnostic · outer node · gap stage-unknownBeweisqualität: complete · Umgebungsvarianten: 1 · Zuerst erfasst: 2026-08-30 · Zuletzt gesehen: 2026-08-31Kandidat für diagnostische Neuprüfung
-
beobachtet UNKNOWN exit 1 ERR_ASSERTION Beweislücke ×1 0.21.3 executionContext=node · moduleSystem=esm · os=linux · runtime=node@22.23 sha256:054c93088b95…node:internal/modules/run_main:<n> · triggerUncaughtException( · ^ …node · unclassified-diagnostic · outer node · gap stage-unknownBeweisqualität: complete · Umgebungsvarianten: 1 · Zuerst erfasst: 2026-08-31 · Zuletzt gesehen: 2026-08-31Kandidat für diagnostische Neuprüfung
-
beobachtet UNKNOWN exit 1 ERR_ASSERTION Beweislücke ×1 0.21.3 executionContext=node · moduleSystem=cjs · os=linux · runtime=node@22.23 sha256:eb0938a47430…node:assert:<n> · throw new AssertionError(obj); · ^ · AssertionError [ERR_ASSERTION]: jest.getVersion() should return 29.6.3node · unclassified-diagnostic · outer node · gap stage-unknownBeweisqualität: complete · Umgebungsvarianten: 1 · Zuerst erfasst: 2026-08-31 · Zuletzt gesehen: 2026-08-31Kandidat für diagnostische Neuprüfung
-
beobachtet UNKNOWN exit 1 ERR_ASSERTION Beweislücke ×1 0.21.3 executionContext=node · moduleSystem=cjs · os=linux · runtime=node@22.23 sha256:769e5b509341…node:internal/process/promises:<n> · triggerUncaughtException(err, true <path> fromPromise */); · ^ …node · unclassified-diagnostic · outer node · gap stage-unknownBeweisqualität: complete · Umgebungsvarianten: 1 · Zuerst erfasst: 2026-08-31 · Zuletzt gesehen: 2026-08-31Kandidat für diagnostische Neuprüfung
-
beobachtet UNKNOWN exit 1 ERR_ASSERTION Beweislücke ×1 0.21.3 executionContext=node · moduleSystem=cjs · os=linux · runtime=node@22.23 sha256:a878372dcfe9…AssertionError [ERR_ASSERTION]: getVersion must return 30.4.2 · <str> !== <str> · at main (<path>:<n>:<n>) · at Object.<anonymous> (<path>:<n>:<n>)node · unclassified-diagnostic · outer node · gap stage-unknownBeweisqualität: complete · Umgebungsvarianten: 1 · Zuerst erfasst: 2026-08-31 · Zuletzt gesehen: 2026-08-31Kandidat für diagnostische Neuprüfung
-
beobachtet UNKNOWN exit 13 Beweislücke ×1 0.21.3 executionContext=node · moduleSystem=esm · os=linux · runtime=node@22.23 sha256:4a939d00eec4…Warning: Detected unsettled top-level await at <url>]:<n> · const ans = await promptPromise; · ^ · fil<path>:<n>node · unclassified-diagnostic · outer node · gap stage-unknownBeweisqualität: complete · Umgebungsvarianten: 1 · Zuerst erfasst: 2026-09-16 · Zuletzt gesehen: 2026-09-16Kandidat für diagnostische Neuprüfung
-
beobachtet UNKNOWN exit 1 ERR_ASSERTION Beweislücke ×1 0.21.3 executionContext=node · moduleSystem=cjs · os=linux · runtime=node@22.23 sha256:b12460008ca6…Test failed: AssertionError [ERR_ASSERTION]: Expected values to be strictly equal: · true !== false · at runTests (<url>) · at <url>node · unclassified-diagnostic · outer node · gap stage-unknownBeweisqualität: complete · Umgebungsvarianten: 1 · Zuerst erfasst: 2026-09-16 · Zuletzt gesehen: 2026-09-16Kandidat für diagnostische Neuprüfung
-
beobachtet UNKNOWN exit 1 Beweislücke ×1 0.21.3 executionContext=node · moduleSystem=cjs · os=linux · runtime=node@22.23 sha256:c0573fd829b8…<url> · import confirm, { promptConfirm } from <str>; · ^^^^^^^ · SyntaxError: The requested module <str> does not provide an export named <str>node · unclassified-diagnostic · outer node · gap stage-unknownBeweisqualität: complete · Umgebungsvarianten: 1 · Zuerst erfasst: 2026-09-16 · Zuletzt gesehen: 2026-09-16Kandidat für diagnostische Neuprüfung
-
beobachtet UNKNOWN exit 1 ERR_ASSERTION Beweislücke ×1 0.21.3 executionContext=node · moduleSystem=cjs · os=linux · runtime=node@22.23 sha256:deb29d18a641…Test failed: AssertionError [ERR_ASSERTION]: Expected values to be strictly equal: · + actual - expected · + <str> · - <str>node · unclassified-diagnostic · outer node · gap stage-unknownBeweisqualität: complete · Umgebungsvarianten: 1 · Zuerst erfasst: 2026-09-16 · Zuletzt gesehen: 2026-09-16Kandidat für diagnostische Neuprüfung
-
beobachtet UNKNOWN exit 1 ERR_ASSERTION Beweislücke ×1 0.21.3 executionContext=node · moduleSystem=esm · os=linux · runtime=node@22.23 sha256:eff444dbb236…Contract test failure: AssertionError [ERR_ASSERTION]: Plain object should not be identified as Separator · true !== false · at testSeparator (<url>) …node · unclassified-diagnostic · outer node · gap stage-unknownBeweisqualität: complete · Umgebungsvarianten: 1 · Zuerst erfasst: 2026-09-16 · Zuletzt gesehen: 2026-09-16Kandidat für diagnostische Neuprüfung