Recordsnpmtinyspy3.0.2tinyspy.restoreAll
OS × runtime at a glance
Reading a cell: The number is how many recorded observations the rate divides — one build files an observation per stage it reached, so it counts neither builds nor machines nor people. The document beside it is a different fact from a different source: whether a sample exists at that coordinate, and how our own run of it went there.
- no sample at this coordinate yet
- there is a sample here, and nothing of ours has run it at this coordinate yet
- there is a sample here, and our run of it at this coordinate came back clean
- there is a sample here, and our run of it at this coordinate failed
- there is a sample here, and this coordinate records both a passing and a failing run of it
- nothing recorded — unknown, never "works" and never "broken"
- there is a level below this cell — click to open it
A document means there is a sample at that coordinate. Whether one EXISTS is a fact about this release and this API and does not change with OS, runtime or package manager; its COLOUR is how that sample ran in the environment you are looking at.
Published samples
- tinyspy 3.0.2: restoreAll This network offers one thing: a sample that builds. It ran the sample in a sandbox and kept the signed receipt. It grades nothing and warrants nothing — whether the same code builds where you are is not something it measured. HOWtinyspy.restoreAllnode 22.23.2 MIT-0 · 2026-09-05
Compatibility matrix
Project-level observations and symbol/contract verifications are counted separately and never combined.
These counts do not distinguish how the symbol was called: overloads, argument shapes and options are pooled together. What a particular call shape does is proven by a sample's contract, not by these numbers.
| Environment | Confidence | Observations | Verified | Pass rate | Peers | Last seen |
|---|---|---|---|---|---|---|
| node 22 · JS · npm · linux glibc · docker
Observations: PROJECT_TEST 1✓ — Verified: CONTRACT 1✓
|
LOW | 1 | 1 | 100% | 1 · 1✓ | 2026-09-17 |
| node 22.23 · JS · npm · linux glibc
Observations: PROJECT_PROCESS 7✓ — Verified: UNKNOWN 0✓ 1✕
|
MEDIUM | 7 | 1 | 88% | 2 | 2026-09-05 |
snapshot · 2026-09-17
Failure clusters
-
observed PROCESS_START process start failed Evidence gap ×14 3.0.2 → 4.0.4 → 4.0.6 executionContext=node sha256:c12549970456…· structured-termination · gap diagnostic-missingEvidence quality: partial · Environment variants: 3 · First recorded: 2026-08-31 · Last seen: 2026-09-16Diagnostic re-verification candidate
-
observed PROJECT_TEST ELIFECYCLE Evidence gap ×4 3.0.2 → 4.0.4 executionContext=node · os=windows · runtime=node@24.13Evidence quality: legacy-evidence-incomplete · Environment variants: 3 · First recorded: 2026-08-21 · Last seen: 2026-08-26Diagnostic re-verification candidate
-
observed UNKNOWN exit 1 Evidence gap ×3 3.0.2 executionContext=node · moduleSystem=esm · os=linux · runtime=node@22.23 sha256:8fd30f2a6304…fil<path>:<n> · throw new Error(errorMsg); · ^ · Error: Vitest failed to access its internal state.node · unclassified-diagnostic · outer node · gap stage-unknownEvidence quality: complete · Environment variants: 1 · First recorded: 2026-08-31 · Last seen: 2026-09-08Diagnostic re-verification candidate
-
observed UNKNOWN exit 1 Evidence gap ×3 3.0.2 executionContext=node · moduleSystem=cjs · os=windows · runtime=node@24.13 sha256:c113861ea657…<str> is not recognized as an internal or external command, · operable program or batch file. · > wslpad@1.1.0 test · > vitest runnpm · unclassified-diagnostic · outer npm test · gap stage-unknownEvidence quality: complete · Environment variants: 1 · First recorded: 2026-09-16 · Last seen: 2026-09-16Diagnostic re-verification candidate
-
observed UNKNOWN exit 1 Evidence gap ×2 3.0.2 executionContext=node · moduleSystem=esm · os=linux · runtime=node@22.23 sha256:42623a56826f…fil<path>:<n> · Object.defineProperty(expect.not, expectAssertionName, { · ^ · TypeError: Object.defineProperty called on non-objectnode · unclassified-diagnostic · outer node · gap stage-unknownEvidence quality: complete · Environment variants: 1 · First recorded: 2026-09-03 · Last seen: 2026-09-04Diagnostic re-verification candidate
-
observed UNKNOWN exit 1 Evidence gap ×2 3.0.2 executionContext=node · moduleSystem=cjs · os=linux · runtime=node@22.23 sha256:3b3190f2cd44…doc: cannot find package <str> in any of: · ($GOROOT not set) · <path> (from $GOPATH)go · unclassified-diagnostic · outer go · gap stage-unknownEvidence quality: complete · Environment variants: 1 · First recorded: 2026-09-04 · Last seen: 2026-09-04Diagnostic re-verification candidate
-
observed UNKNOWN exit 1 Evidence gap ×2 3.0.2 executionContext=node · moduleSystem=cjs · os=linux · runtime=node@22.23 sha256:f0288eb0529f…Traceback (most recent call last): · File <str>, line 19, in <module> · AssertionError· unclassified-diagnostic · gap stage-unknownEvidence quality: complete · Environment variants: 1 · First recorded: 2026-09-04 · Last seen: 2026-09-04Diagnostic re-verification candidate
-
observed PROJECT_TYPECHECK Evidence gap ×1 3.0.2 executionContext=node · moduleSystem=cjs · os=windows · runtime=node@24.13Evidence quality: legacy-evidence-incomplete · Environment variants: 1 · First recorded: 2026-08-21 · Last seen: 2026-08-21
-
observed UNKNOWN exit 1 Evidence gap ×1 3.0.2 executionContext=node · moduleSystem=cjs · os=linux · runtime=node@22.23 sha256:72ba2d1e946f…<path>: No module named pippython3 · unclassified-diagnostic · outer python3 · gap stage-unknownEvidence quality: complete · Environment variants: 1 · First recorded: 2026-08-31 · Last seen: 2026-08-31Diagnostic re-verification candidate
-
observed UNKNOWN exit 1 Evidence gap ×1 3.0.2 executionContext=node · moduleSystem=cjs · os=linux · runtime=node@22.23 sha256:91ad26545eb1…node:internal/modules/cjs/loader:<n> · throw err; · ^ · Error: Cannot find module <str>node · unclassified-diagnostic · outer node · gap stage-unknownEvidence quality: complete · Environment variants: 1 · First recorded: 2026-08-31 · Last seen: 2026-08-31Diagnostic re-verification candidate
-
observed UNKNOWN exit 1 Evidence gap ×1 3.0.2 executionContext=node · moduleSystem=cjs · os=linux · runtime=node@22.23 sha256:d7f5d491441c…Traceback (most recent call last): · File <str>, line 71, in <module> · AssertionError: is_annotated must return True for Annotated· unclassified-diagnostic · gap stage-unknownEvidence quality: complete · Environment variants: 1 · First recorded: 2026-08-31 · Last seen: 2026-08-31Diagnostic re-verification candidate
-
observed UNKNOWN exit 1 Evidence gap ×1 3.0.2 executionContext=node · moduleSystem=esm · os=linux · runtime=node@22.23 sha256:67b21c7b2753…Contract test failed: TypeError: Cannot assign to read only property <str> of function 'class Assertion { · constructor(obj) { · this._obj = obj; · }node · unclassified-diagnostic · outer node · gap stage-unknownEvidence quality: complete · Environment variants: 1 · First recorded: 2026-09-03 · Last seen: 2026-09-03Diagnostic re-verification candidate
Showing the 12 most-reported of 30 recorded failure clusters. The rest are single reports.