기록npmsocks2.8.10SocksClient.parseUDPFrame
공개한 샘플
- socks 2.8.10: SocksClient.parseUDPFrame 이 네트워크가 제공하는 것은 하나입니다. 빌드되는 샘플. 샌드박스에서 돌리고 서명된 영수증을 보관합니다. 등급을 매기지 않고 무엇도 보증하지 않습니다 — 같은 코드가 당신 환경에서 빌드되는지는 측정한 적이 없습니다. HOWSocksClient.parseUDPFramenode 22.23.2 MIT-0 · 2026-09-07
호환성 매트릭스
프로젝트 수준 관측과 심벌/컨트랙트 검증은 따로 집계하며 절대 합산하지 않습니다.
이 수치는 심볼을 어떻게 호출했는지 구분하지 않습니다. 오버로드, 인자 형태, 옵션이 한데 묶여 집계됩니다. 특정 호출 형태가 어떻게 동작하는지는 이 숫자가 아니라 샘플의 계약이 증명합니다.
| 환경 | 신뢰도 | 관측 | 검증 | 통과율 | 피어 | 마지막 관측 |
|---|---|---|---|---|---|---|
| node 22 · JS · npm · linux glibc · docker
관측: PROJECT_TEST 1✓ — 검증: CONTRACT 1✓
|
LOW | 1 | 1 | 100% | 1 · 1✓ | 2026-09-17 |
snapshot · 2026-09-17
실패 클러스터
-
관측됨 UNKNOWN exit 1 증거 공백 ×2 2.8.10 executionContext=node · moduleSystem=esm · os=linux · runtime=node@22.23 sha256:536db39a2e08…<path>:<n> · const closeError = new Error(<str>) · ^ · Error: command failednpm · unclassified-diagnostic · outer npm test · gap stage-unknown증거 품질: complete · 환경 변형: 1 · 최초 관측: 2026-10-18 · 마지막 관측: 2026-10-18진단 재검증 후보
-
관측됨 UNKNOWN exit 1 ERR_ASSERTION 증거 공백 ×1 2.8.10 executionContext=node · moduleSystem=cjs · os=linux · runtime=node@22.23 sha256:0ab3a7004d66…node:assert:<n> · throw new AssertionError(obj); · ^ · AssertionError [ERR_ASSERTION]: Expected values to be strictly equal:node · unclassified-diagnostic · outer node · gap stage-unknown증거 품질: complete · 환경 변형: 1 · 최초 관측: 2026-09-07 · 마지막 관측: 2026-09-07진단 재검증 후보
-
관측됨 UNKNOWN exit 1 ERR_ASSERTION 증거 공백 ×1 2.8.10 executionContext=node · moduleSystem=cjs · os=linux · runtime=node@22.23 sha256:0d62cac8c07a…AssertionError [ERR_ASSERTION]: Expected values to be strictly equal: · + actual - expected · + <str> · - <str>node · unclassified-diagnostic · outer node · gap stage-unknown증거 품질: complete · 환경 변형: 1 · 최초 관측: 2026-09-07 · 마지막 관측: 2026-09-07진단 재검증 후보
-
관측됨 UNKNOWN exit 1 ERR_ASSERTION 증거 공백 ×1 2.8.10 executionContext=node · moduleSystem=cjs · os=linux · runtime=node@22.23 sha256:719dc399517f…AssertionError [ERR_ASSERTION]: Expected values to be strictly equal: · 8080 !== 38853 · at runTests (<path>:<n>:<n>) …node · unclassified-diagnostic · outer node · gap stage-unknown증거 품질: complete · 환경 변형: 1 · 최초 관측: 2026-09-07 · 마지막 관측: 2026-09-07진단 재검증 후보
-
관측됨 UNKNOWN exit 1 ERR_ASSERTION 증거 공백 ×1 2.8.10 executionContext=node · moduleSystem=cjs · os=linux · runtime=node@22.23 sha256:821bb102fcd0…node:assert:<n> · throw err; · ^ · AssertionError [ERR_ASSERTION]: The input did not match the regular expression <path> of the internal SmartBuffer/. Input:node · unclassified-diagnostic · outer node · gap stage-unknown증거 품질: complete · 환경 변형: 1 · 최초 관측: 2026-09-07 · 마지막 관측: 2026-09-07진단 재검증 후보
-
관측됨 UNKNOWN exit 1 ERR_ASSERTION 증거 공백 ×1 2.8.10 executionContext=node · moduleSystem=cjs · os=linux · runtime=node@22.23 sha256:cf0f5652a811…Contract test failed: AssertionError [ERR_ASSERTION]: should reject non-connect command · at async testContract (<url>) { · generatedMessage: false, …node · unclassified-diagnostic · outer node · gap stage-unknown증거 품질: complete · 환경 변형: 1 · 최초 관측: 2026-09-07 · 마지막 관측: 2026-09-07진단 재검증 후보
-
관측됨 UNKNOWN exit 1 증거 공백 ×1 2.8.10 executionContext=node · moduleSystem=esm · os=linux · runtime=node@22.23 sha256:a327536006a1…<url> · import { getAgent, Agent, HttpAgent, HttpsAgent, cache } from <str>; · ^^^^^ …npm · unclassified-diagnostic · outer npm test · gap stage-unknown증거 품질: complete · 환경 변형: 1 · 최초 관측: 2026-10-17 · 마지막 관측: 2026-10-17진단 재검증 후보