Aufzeichnungennpmsocks2.8.10SocksClient.createUDPFrame
Veröffentlichte Beispiele
- socks 2.8.10: SocksClient.createUDPFrame Dieses Netzwerk bietet eine Sache: ein Sample, das baut. Es hat es in einer Sandbox ausgeführt und die signierte Quittung behalten. Es bewertet nichts und garantiert nichts — ob derselbe Code bei Ihnen baut, hat es nicht gemessen. HOWSocksClient.createUDPFrame MIT-0 · 2026-09-07
Kompatibilitätsmatrix
Beobachtungen auf Projektebene und Symbol-/Contract-Verifizierungen werden getrennt gezählt und niemals zusammengerechnet.
Diese Zahlen unterscheiden nicht, wie das Symbol aufgerufen wurde: Überladungen, Argumentformen und Optionen werden zusammengefasst. Was eine bestimmte Aufrufform tut, beweist der Vertrag eines Samples – nicht diese Zahlen.
| Umgebung | Konfidenz | Beobachtungen | Verifiziert | Erfolgsquote | Peers | Zuletzt gesehen |
|---|---|---|---|---|---|---|
| node 22 · JS · npm · linux glibc · docker
Beobachtungen: PROJECT_TEST 1✓ — Verifiziert: CONTRACT 1✓
|
LOW | 1 | 1 | 100 % | 1 · 1✓ | 2026-09-17 |
snapshot · 2026-09-17
Fehler-Cluster
-
beobachtet UNKNOWN exit 1 Beweislücke ×2 2.8.10 executionContext=node · moduleSystem=esm · os=linux · runtime=node@22.23 sha256:536db39a2e08…<path>:<n> · const closeError = new Error(<str>) · ^ · Error: command failednpm · unclassified-diagnostic · outer npm test · gap stage-unknownBeweisqualität: complete · Umgebungsvarianten: 1 · Zuerst erfasst: 2026-10-18 · Zuletzt gesehen: 2026-10-18Kandidat für diagnostische Neuprüfung
-
beobachtet UNKNOWN exit 1 ERR_ASSERTION Beweislücke ×1 2.8.10 executionContext=node · moduleSystem=cjs · os=linux · runtime=node@22.23 sha256:0ab3a7004d66…node:assert:<n> · throw new AssertionError(obj); · ^ · AssertionError [ERR_ASSERTION]: Expected values to be strictly equal:node · unclassified-diagnostic · outer node · gap stage-unknownBeweisqualität: complete · Umgebungsvarianten: 1 · Zuerst erfasst: 2026-09-07 · Zuletzt gesehen: 2026-09-07Kandidat für diagnostische Neuprüfung
-
beobachtet UNKNOWN exit 1 ERR_ASSERTION Beweislücke ×1 2.8.10 executionContext=node · moduleSystem=cjs · os=linux · runtime=node@22.23 sha256:0d62cac8c07a…AssertionError [ERR_ASSERTION]: Expected values to be strictly equal: · + actual - expected · + <str> · - <str>node · unclassified-diagnostic · outer node · gap stage-unknownBeweisqualität: complete · Umgebungsvarianten: 1 · Zuerst erfasst: 2026-09-07 · Zuletzt gesehen: 2026-09-07Kandidat für diagnostische Neuprüfung
-
beobachtet UNKNOWN exit 1 ERR_ASSERTION Beweislücke ×1 2.8.10 executionContext=node · moduleSystem=cjs · os=linux · runtime=node@22.23 sha256:719dc399517f…AssertionError [ERR_ASSERTION]: Expected values to be strictly equal: · 8080 !== 38853 · at runTests (<path>:<n>:<n>) …node · unclassified-diagnostic · outer node · gap stage-unknownBeweisqualität: complete · Umgebungsvarianten: 1 · Zuerst erfasst: 2026-09-07 · Zuletzt gesehen: 2026-09-07Kandidat für diagnostische Neuprüfung
-
beobachtet UNKNOWN exit 1 ERR_ASSERTION Beweislücke ×1 2.8.10 executionContext=node · moduleSystem=cjs · os=linux · runtime=node@22.23 sha256:821bb102fcd0…node:assert:<n> · throw err; · ^ · AssertionError [ERR_ASSERTION]: The input did not match the regular expression <path> of the internal SmartBuffer/. Input:node · unclassified-diagnostic · outer node · gap stage-unknownBeweisqualität: complete · Umgebungsvarianten: 1 · Zuerst erfasst: 2026-09-07 · Zuletzt gesehen: 2026-09-07Kandidat für diagnostische Neuprüfung
-
beobachtet UNKNOWN exit 1 ERR_ASSERTION Beweislücke ×1 2.8.10 executionContext=node · moduleSystem=cjs · os=linux · runtime=node@22.23 sha256:cf0f5652a811…Contract test failed: AssertionError [ERR_ASSERTION]: should reject non-connect command · at async testContract (<url>) { · generatedMessage: false, …node · unclassified-diagnostic · outer node · gap stage-unknownBeweisqualität: complete · Umgebungsvarianten: 1 · Zuerst erfasst: 2026-09-07 · Zuletzt gesehen: 2026-09-07Kandidat für diagnostische Neuprüfung
-
beobachtet UNKNOWN exit 1 Beweislücke ×1 2.8.10 executionContext=node · moduleSystem=esm · os=linux · runtime=node@22.23 sha256:a327536006a1…<url> · import { getAgent, Agent, HttpAgent, HttpsAgent, cache } from <str>; · ^^^^^ …npm · unclassified-diagnostic · outer npm test · gap stage-unknownBeweisqualität: complete · Umgebungsvarianten: 1 · Zuerst erfasst: 2026-10-17 · Zuletzt gesehen: 2026-10-17Kandidat für diagnostische Neuprüfung
-
beobachtet PROJECT_TEST exit 1 ERR_ASSERTION ×1 2.8.10 executionContext=node · moduleSystem=esm · os=linux · runtime=node@22.23 sha256:4904e63e5296…AssertionError [ERR_ASSERTION]: Expected values to be strictly equal: · + actual - expected · + <str> · - <str>javascript/test-runner · test-runner-diagnostic · outer npm testBeweisqualität: complete · Umgebungsvarianten: 1 · Zuerst erfasst: 2026-10-18 · Zuletzt gesehen: 2026-10-18
-
beobachtet PROJECT_TEST exit 1 ERR_ASSERTION ×1 2.8.10 executionContext=node · moduleSystem=esm · os=linux · runtime=node@22.23 sha256:8c3539be02dd…AssertionError [ERR_ASSERTION]: Expected values to be strictly deep-equal: · + actual - expected · Comparison { · + message: <str>,javascript/test-runner · test-runner-diagnostic · outer npm testBeweisqualität: complete · Umgebungsvarianten: 1 · Zuerst erfasst: 2026-10-18 · Zuletzt gesehen: 2026-10-18
-
beobachtet PROJECT_TEST exit 1 ERR_ASSERTION ×1 2.8.10 executionContext=node · moduleSystem=esm · os=linux · runtime=node@22.23 sha256:ccb20bbc5842…AssertionError [ERR_ASSERTION]: Expected values to be strictly equal: · + actual - expected · + undefined · - <str>javascript/test-runner · test-runner-diagnostic · outer npm testBeweisqualität: complete · Umgebungsvarianten: 1 · Zuerst erfasst: 2026-10-18 · Zuletzt gesehen: 2026-10-18
-
beobachtet UNKNOWN exit 1 Beweislücke ×1 2.8.10 executionContext=node · moduleSystem=esm · os=linux · runtime=node@22.23 sha256:5cb8e084fdab…<path>:<n> · throw new error_1.UnsignedMetadataError(`${delegatedRole} was signed by ${signingKeys.size}/${role.threshold} keys`); · ^ …node · unclassified-diagnostic · outer node · gap stage-unknownBeweisqualität: complete · Umgebungsvarianten: 1 · Zuerst erfasst: 2026-10-18 · Zuletzt gesehen: 2026-10-18Kandidat für diagnostische Neuprüfung