Registrosnpmsocks2.8.10SocksClient.createConnection
Exemplos publicados
- socks 2.8.10: SocksClient.createConnection Esta rede oferece uma coisa: uma amostra que compila. Ela a executou em um sandbox e guardou o recibo assinado. Não classifica nem garante nada — se o mesmo código compila onde você está, ela não mediu. HOWSocksClient.createConnection MIT-0 · 2026-09-07
Matriz de compatibilidade
Observações no nível do projeto e verificações de símbolo/contrato são contadas separadamente e nunca somadas.
Estas contagens não distinguem como o símbolo foi chamado: sobrecargas, formatos de argumentos e opções são agrupados. O que uma forma de chamada específica faz é provado pelo contrato de uma amostra, não por estes números.
| Ambiente | Confiança | Observações | Verificado | Taxa de aprovação | Peers | Visto por último |
|---|---|---|---|---|---|---|
| node 22 · JS · npm · linux glibc · docker
Observações: PROJECT_TEST 1✓ — Verificado: CONTRACT 1✓
|
LOW | 1 | 1 | 100% | 1 · 1✓ | 2026-09-17 |
snapshot · 2026-09-17
Clusters de falha
-
observado UNKNOWN exit 1 Lacuna de evidência ×2 2.8.10 executionContext=node · moduleSystem=esm · os=linux · runtime=node@22.23 sha256:536db39a2e08…<path>:<n> · const closeError = new Error(<str>) · ^ · Error: command failednpm · unclassified-diagnostic · outer npm test · gap stage-unknownQualidade da evidência: complete · Variantes de ambiente: 1 · Primeiro registro: 2026-10-18 · Visto por último: 2026-10-18Candidato a reverificação diagnóstica
-
observado UNKNOWN exit 1 ERR_ASSERTION Lacuna de evidência ×1 2.8.10 executionContext=node · moduleSystem=cjs · os=linux · runtime=node@22.23 sha256:0ab3a7004d66…node:assert:<n> · throw new AssertionError(obj); · ^ · AssertionError [ERR_ASSERTION]: Expected values to be strictly equal:node · unclassified-diagnostic · outer node · gap stage-unknownQualidade da evidência: complete · Variantes de ambiente: 1 · Primeiro registro: 2026-09-07 · Visto por último: 2026-09-07Candidato a reverificação diagnóstica
-
observado UNKNOWN exit 1 ERR_ASSERTION Lacuna de evidência ×1 2.8.10 executionContext=node · moduleSystem=cjs · os=linux · runtime=node@22.23 sha256:0d62cac8c07a…AssertionError [ERR_ASSERTION]: Expected values to be strictly equal: · + actual - expected · + <str> · - <str>node · unclassified-diagnostic · outer node · gap stage-unknownQualidade da evidência: complete · Variantes de ambiente: 1 · Primeiro registro: 2026-09-07 · Visto por último: 2026-09-07Candidato a reverificação diagnóstica
-
observado UNKNOWN exit 1 ERR_ASSERTION Lacuna de evidência ×1 2.8.10 executionContext=node · moduleSystem=cjs · os=linux · runtime=node@22.23 sha256:719dc399517f…AssertionError [ERR_ASSERTION]: Expected values to be strictly equal: · 8080 !== 38853 · at runTests (<path>:<n>:<n>) …node · unclassified-diagnostic · outer node · gap stage-unknownQualidade da evidência: complete · Variantes de ambiente: 1 · Primeiro registro: 2026-09-07 · Visto por último: 2026-09-07Candidato a reverificação diagnóstica
-
observado UNKNOWN exit 1 ERR_ASSERTION Lacuna de evidência ×1 2.8.10 executionContext=node · moduleSystem=cjs · os=linux · runtime=node@22.23 sha256:821bb102fcd0…node:assert:<n> · throw err; · ^ · AssertionError [ERR_ASSERTION]: The input did not match the regular expression <path> of the internal SmartBuffer/. Input:node · unclassified-diagnostic · outer node · gap stage-unknownQualidade da evidência: complete · Variantes de ambiente: 1 · Primeiro registro: 2026-09-07 · Visto por último: 2026-09-07Candidato a reverificação diagnóstica
-
observado UNKNOWN exit 1 ERR_ASSERTION Lacuna de evidência ×1 2.8.10 executionContext=node · moduleSystem=cjs · os=linux · runtime=node@22.23 sha256:cf0f5652a811…Contract test failed: AssertionError [ERR_ASSERTION]: should reject non-connect command · at async testContract (<url>) { · generatedMessage: false, …node · unclassified-diagnostic · outer node · gap stage-unknownQualidade da evidência: complete · Variantes de ambiente: 1 · Primeiro registro: 2026-09-07 · Visto por último: 2026-09-07Candidato a reverificação diagnóstica
-
observado UNKNOWN exit 1 Lacuna de evidência ×1 2.8.10 executionContext=node · moduleSystem=esm · os=linux · runtime=node@22.23 sha256:a327536006a1…<url> · import { getAgent, Agent, HttpAgent, HttpsAgent, cache } from <str>; · ^^^^^ …npm · unclassified-diagnostic · outer npm test · gap stage-unknownQualidade da evidência: complete · Variantes de ambiente: 1 · Primeiro registro: 2026-10-17 · Visto por último: 2026-10-17Candidato a reverificação diagnóstica
-
observado PROJECT_TEST exit 1 ERR_ASSERTION ×1 2.8.10 executionContext=node · moduleSystem=esm · os=linux · runtime=node@22.23 sha256:4904e63e5296…AssertionError [ERR_ASSERTION]: Expected values to be strictly equal: · + actual - expected · + <str> · - <str>javascript/test-runner · test-runner-diagnostic · outer npm testQualidade da evidência: complete · Variantes de ambiente: 1 · Primeiro registro: 2026-10-18 · Visto por último: 2026-10-18
-
observado PROJECT_TEST exit 1 ERR_ASSERTION ×1 2.8.10 executionContext=node · moduleSystem=esm · os=linux · runtime=node@22.23 sha256:8c3539be02dd…AssertionError [ERR_ASSERTION]: Expected values to be strictly deep-equal: · + actual - expected · Comparison { · + message: <str>,javascript/test-runner · test-runner-diagnostic · outer npm testQualidade da evidência: complete · Variantes de ambiente: 1 · Primeiro registro: 2026-10-18 · Visto por último: 2026-10-18
-
observado PROJECT_TEST exit 1 ERR_ASSERTION ×1 2.8.10 executionContext=node · moduleSystem=esm · os=linux · runtime=node@22.23 sha256:ccb20bbc5842…AssertionError [ERR_ASSERTION]: Expected values to be strictly equal: · + actual - expected · + undefined · - <str>javascript/test-runner · test-runner-diagnostic · outer npm testQualidade da evidência: complete · Variantes de ambiente: 1 · Primeiro registro: 2026-10-18 · Visto por último: 2026-10-18
-
observado UNKNOWN exit 1 Lacuna de evidência ×1 2.8.10 executionContext=node · moduleSystem=esm · os=linux · runtime=node@22.23 sha256:5cb8e084fdab…<path>:<n> · throw new error_1.UnsignedMetadataError(`${delegatedRole} was signed by ${signingKeys.size}/${role.threshold} keys`); · ^ …node · unclassified-diagnostic · outer node · gap stage-unknownQualidade da evidência: complete · Variantes de ambiente: 1 · Primeiro registro: 2026-10-18 · Visto por último: 2026-10-18Candidato a reverificação diagnóstica