Aufzeichnungennpmminimist1.2.8minimist
Veröffentlichte Beispiele
- minimist 1.2.8: parse CLI arguments with string, boolean options, aliases and defaults using minimist Dieses Netzwerk bietet eine Sache: ein Sample, das baut. Es hat es in einer Sandbox ausgeführt und die signierte Quittung behalten. Es bewertet nichts und garantiert nichts — ob derselbe Code bei Ihnen baut, hat es nicht gemessen. HOWminimist MIT-0 · 2026-08-28
Kompatibilitätsmatrix
Beobachtungen auf Projektebene und Symbol-/Contract-Verifizierungen werden getrennt gezählt und niemals zusammengerechnet.
Diese Zahlen unterscheiden nicht, wie das Symbol aufgerufen wurde: Überladungen, Argumentformen und Optionen werden zusammengefasst. Was eine bestimmte Aufrufform tut, beweist der Vertrag eines Samples – nicht diese Zahlen.
| Umgebung | Konfidenz | Beobachtungen | Verifiziert | Erfolgsquote | Peers | Zuletzt gesehen |
|---|---|---|---|---|---|---|
| node 22 · JS · npm · linux musl · docker
Verifiziert: CONTRACT 1✓
|
LOW | 0 | 1 | 100 % | 0 · 1✓ | 2026-08-28 |
snapshot · 2026-09-15
Fehler-Cluster
-
beobachtet UNKNOWN exit 1 ERR_PNPM_RECURSIVE_RUN_FIRST_FAIL Beweislücke ×31 1.2.8 executionContext=node · moduleSystem=esm · os=windows · runtime=node@24.13 sha256:9f91c9753081…(node:<n>) ExperimentalWarning: SQLite is an experimental feature and might change at any time …pnpm · unclassified-diagnostic · outer pnpm · gap stage-unknownBeweisqualität: complete · Umgebungsvarianten: 1 · Zuerst erfasst: 2026-09-01 · Zuletzt gesehen: 2026-09-15Kandidat für diagnostische Neuprüfung
-
beobachtet UNKNOWN exit 1 ERR_PNPM_RECURSIVE_EXEC_FIRST_FAIL Beweislücke ×28 1.2.8 executionContext=node · moduleSystem=esm · os=windows · runtime=node@24.13 sha256:979755e6489d…(node:<n>) ExperimentalWarning: SQLite is an experimental feature and might change at any time …pnpm · unclassified-diagnostic · outer pnpm · gap stage-unknownBeweisqualität: complete · Umgebungsvarianten: 1 · Zuerst erfasst: 2026-09-01 · Zuletzt gesehen: 2026-09-15Kandidat für diagnostische Neuprüfung
-
beobachtet UNKNOWN exit 1 ERR_PNPM_RECURSIVE_EXEC_FIRST_FAIL Beweislücke ×11 1.2.8 executionContext=node · moduleSystem=esm · os=windows · runtime=node@24.13 sha256:73873d2c4aed…<str> is not recognized as an internal or external command, · operable program or batch file. · undefined …pnpm · unclassified-diagnostic · outer pnpm · gap stage-unknownBeweisqualität: complete · Umgebungsvarianten: 1 · Zuerst erfasst: 2026-09-01 · Zuletzt gesehen: 2026-09-01Kandidat für diagnostische Neuprüfung
-
beobachtet PROJECT_TEST exit 1 ELIFECYCLE ×10 1.2.8 executionContext=node · moduleSystem=esm · os=windows · runtime=node@24.13 sha256:7711694d48fa…ELIFECYCLE Test failed. See above for more details.javascript/test-runner · test-runner-diagnostic · outer pnpm testBeweisqualität: complete · Umgebungsvarianten: 1 · Zuerst erfasst: 2026-08-29 · Zuletzt gesehen: 2026-09-01
-
beobachtet UNKNOWN exit 1 ELIFECYCLE Beweislücke ×7 1.2.8 executionContext=node · moduleSystem=esm · os=windows · runtime=node@24.13 sha256:f398b989dbea…> devhotel-workspace@0.4.3 lint <path> · > eslint . · <path> …pnpm · unclassified-diagnostic · outer pnpm · gap stage-unknownBeweisqualität: complete · Umgebungsvarianten: 1 · Zuerst erfasst: 2026-09-01 · Zuletzt gesehen: 2026-09-01Kandidat für diagnostische Neuprüfung
-
beobachtet UNKNOWN exit 1 ERR_PNPM_RECURSIVE_RUN_FIRST_FAIL Beweislücke ×5 1.2.8 executionContext=node · moduleSystem=esm · os=windows · runtime=node@24.13 sha256:0c4a78e30813…> devhotel-workspace@0.5.2 typecheck <path> · > pnpm -r typecheck · Scope: 4 of 5 workspace projects · packages/shared typecheck$ tsc --noEmitpnpm · unclassified-diagnostic · outer pnpm · gap stage-unknownBeweisqualität: complete · Umgebungsvarianten: 1 · Zuerst erfasst: 2026-09-13 · Zuletzt gesehen: 2026-09-13Kandidat für diagnostische Neuprüfung
-
beobachtet UNKNOWN exit 1 Beweislücke ×5 1.2.8 executionContext=node · moduleSystem=cjs · os=windows · runtime=node@24.13 sha256:bc4d7ddc5bcd…node:internal/modules/cjs/loader:<n> · throw err; · ^ · Error: Cannot find module <str>npm · unclassified-diagnostic · outer npm run · gap stage-unknownBeweisqualität: complete · Umgebungsvarianten: 1 · Zuerst erfasst: 2026-09-13 · Zuletzt gesehen: 2026-09-15Kandidat für diagnostische Neuprüfung
-
beobachtet UNKNOWN exit 1 ERR_PNPM_RECURSIVE_EXEC_FIRST_FAIL Beweislücke ×4 1.2.8 executionContext=node · moduleSystem=esm · os=windows · runtime=node@24.13 sha256:d53178e9c23b…<str> is not recognized as an internal or external command, · operable program or batch file. · undefined · <path>pnpm · unclassified-diagnostic · outer pnpm · gap stage-unknownBeweisqualität: complete · Umgebungsvarianten: 1 · Zuerst erfasst: 2026-08-29 · Zuletzt gesehen: 2026-09-15Kandidat für diagnostische Neuprüfung
-
beobachtet UNKNOWN exit 1 ERR_PNPM_RECURSIVE_RUN_FIRST_FAIL Beweislücke ×4 1.2.8 executionContext=node · moduleSystem=esm · os=windows · runtime=node@24.13 sha256:3b99548df64e…> devhotel-workspace@0.4.3 typecheck <path> · > pnpm -r typecheck · Scope: 4 of 5 workspace projects · packages/shared typecheck$ tsc --noEmitpnpm · unclassified-diagnostic · outer pnpm · gap stage-unknownBeweisqualität: complete · Umgebungsvarianten: 1 · Zuerst erfasst: 2026-09-01 · Zuletzt gesehen: 2026-09-01Kandidat für diagnostische Neuprüfung
-
beobachtet PROJECT_COMPILE exit 2 TS2307 ×4 1.2.8 executionContext=node · moduleSystem=cjs · os=windows · runtime=node@24.13 sha256:0470f88d95bb…lib/hooks/queries/index.ts(<n>,<n>): error TS2307: Cannot find module <str> or its corresponding type declarations. …typescript/tsc · compiler-diagnosticBeweisqualität: complete · Umgebungsvarianten: 1 · Zuerst erfasst: 2026-09-01 · Zuletzt gesehen: 2026-09-01
-
beobachtet PROJECT_COMPILE exit 2 TS7006 ×4 1.2.8 executionContext=node · moduleSystem=cjs · os=windows · runtime=node@24.13 sha256:21025cd78572…app/api/politicians/[id]/real-estates/route.ts(<n>,<n>): error TS7006: Parameter <str> implicitly has an <str> type. …typescript/tsc · compiler-diagnosticBeweisqualität: complete · Umgebungsvarianten: 1 · Zuerst erfasst: 2026-09-01 · Zuletzt gesehen: 2026-09-01
-
beobachtet PROJECT_COMPILE exit 2 TS2561 ×4 1.2.8 executionContext=node · moduleSystem=cjs · os=windows · runtime=node@24.13 sha256:5f96e966539e…app/api/politicians/[id]/real-estates/route.ts(<n>,<n>): error TS2561: Object literal may only specify known properties, but <str> does not exist in type …typescript/tsc · compiler-diagnosticBeweisqualität: complete · Umgebungsvarianten: 1 · Zuerst erfasst: 2026-09-01 · Zuletzt gesehen: 2026-09-01
Es werden die 12 meistgemeldeten von 306 aufgezeichneten Fehlerclustern gezeigt. Der Rest sind Einzelmeldungen.