Recordsnpmminimist1.2.8minimist
Published samples
- minimist 1.2.8: parse CLI arguments with string, boolean options, aliases and defaults using minimist This network offers one thing: a sample that builds. It ran the sample in a sandbox and kept the signed receipt. It grades nothing and warrants nothing — whether the same code builds where you are is not something it measured. HOWminimist MIT-0 · 2026-08-28
Compatibility matrix
Project-level observations and symbol/contract verifications are counted separately and never combined.
These counts do not distinguish how the symbol was called: overloads, argument shapes and options are pooled together. What a particular call shape does is proven by a sample's contract, not by these numbers.
| Environment | Confidence | Observations | Verified | Pass rate | Peers | Last seen |
|---|---|---|---|---|---|---|
| node 22 · JS · npm · linux musl · docker
Verified: CONTRACT 1✓
|
LOW | 0 | 1 | 100% | 0 · 1✓ | 2026-08-28 |
snapshot · 2026-09-15
Failure clusters
-
observed UNKNOWN exit 1 ERR_PNPM_RECURSIVE_RUN_FIRST_FAIL Evidence gap ×31 1.2.8 executionContext=node · moduleSystem=esm · os=windows · runtime=node@24.13 sha256:9f91c9753081…(node:<n>) ExperimentalWarning: SQLite is an experimental feature and might change at any time …pnpm · unclassified-diagnostic · outer pnpm · gap stage-unknownEvidence quality: complete · Environment variants: 1 · First recorded: 2026-09-01 · Last seen: 2026-09-15Diagnostic re-verification candidate
-
observed UNKNOWN exit 1 ERR_PNPM_RECURSIVE_EXEC_FIRST_FAIL Evidence gap ×28 1.2.8 executionContext=node · moduleSystem=esm · os=windows · runtime=node@24.13 sha256:979755e6489d…(node:<n>) ExperimentalWarning: SQLite is an experimental feature and might change at any time …pnpm · unclassified-diagnostic · outer pnpm · gap stage-unknownEvidence quality: complete · Environment variants: 1 · First recorded: 2026-09-01 · Last seen: 2026-09-15Diagnostic re-verification candidate
-
observed UNKNOWN exit 1 ERR_PNPM_RECURSIVE_EXEC_FIRST_FAIL Evidence gap ×11 1.2.8 executionContext=node · moduleSystem=esm · os=windows · runtime=node@24.13 sha256:73873d2c4aed…<str> is not recognized as an internal or external command, · operable program or batch file. · undefined …pnpm · unclassified-diagnostic · outer pnpm · gap stage-unknownEvidence quality: complete · Environment variants: 1 · First recorded: 2026-09-01 · Last seen: 2026-09-01Diagnostic re-verification candidate
-
observed PROJECT_TEST exit 1 ELIFECYCLE ×10 1.2.8 executionContext=node · moduleSystem=esm · os=windows · runtime=node@24.13 sha256:7711694d48fa…ELIFECYCLE Test failed. See above for more details.javascript/test-runner · test-runner-diagnostic · outer pnpm testEvidence quality: complete · Environment variants: 1 · First recorded: 2026-08-29 · Last seen: 2026-09-01
-
observed UNKNOWN exit 1 ELIFECYCLE Evidence gap ×7 1.2.8 executionContext=node · moduleSystem=esm · os=windows · runtime=node@24.13 sha256:f398b989dbea…> devhotel-workspace@0.4.3 lint <path> · > eslint . · <path> …pnpm · unclassified-diagnostic · outer pnpm · gap stage-unknownEvidence quality: complete · Environment variants: 1 · First recorded: 2026-09-01 · Last seen: 2026-09-01Diagnostic re-verification candidate
-
observed UNKNOWN exit 1 ERR_PNPM_RECURSIVE_RUN_FIRST_FAIL Evidence gap ×5 1.2.8 executionContext=node · moduleSystem=esm · os=windows · runtime=node@24.13 sha256:0c4a78e30813…> devhotel-workspace@0.5.2 typecheck <path> · > pnpm -r typecheck · Scope: 4 of 5 workspace projects · packages/shared typecheck$ tsc --noEmitpnpm · unclassified-diagnostic · outer pnpm · gap stage-unknownEvidence quality: complete · Environment variants: 1 · First recorded: 2026-09-13 · Last seen: 2026-09-13Diagnostic re-verification candidate
-
observed UNKNOWN exit 1 Evidence gap ×5 1.2.8 executionContext=node · moduleSystem=cjs · os=windows · runtime=node@24.13 sha256:bc4d7ddc5bcd…node:internal/modules/cjs/loader:<n> · throw err; · ^ · Error: Cannot find module <str>npm · unclassified-diagnostic · outer npm run · gap stage-unknownEvidence quality: complete · Environment variants: 1 · First recorded: 2026-09-13 · Last seen: 2026-09-15Diagnostic re-verification candidate
-
observed UNKNOWN exit 1 ERR_PNPM_RECURSIVE_EXEC_FIRST_FAIL Evidence gap ×4 1.2.8 executionContext=node · moduleSystem=esm · os=windows · runtime=node@24.13 sha256:d53178e9c23b…<str> is not recognized as an internal or external command, · operable program or batch file. · undefined · <path>pnpm · unclassified-diagnostic · outer pnpm · gap stage-unknownEvidence quality: complete · Environment variants: 1 · First recorded: 2026-08-29 · Last seen: 2026-09-15Diagnostic re-verification candidate
-
observed UNKNOWN exit 1 ERR_PNPM_RECURSIVE_RUN_FIRST_FAIL Evidence gap ×4 1.2.8 executionContext=node · moduleSystem=esm · os=windows · runtime=node@24.13 sha256:3b99548df64e…> devhotel-workspace@0.4.3 typecheck <path> · > pnpm -r typecheck · Scope: 4 of 5 workspace projects · packages/shared typecheck$ tsc --noEmitpnpm · unclassified-diagnostic · outer pnpm · gap stage-unknownEvidence quality: complete · Environment variants: 1 · First recorded: 2026-09-01 · Last seen: 2026-09-01Diagnostic re-verification candidate
-
observed PROJECT_COMPILE exit 2 TS2307 ×4 1.2.8 executionContext=node · moduleSystem=cjs · os=windows · runtime=node@24.13 sha256:0470f88d95bb…lib/hooks/queries/index.ts(<n>,<n>): error TS2307: Cannot find module <str> or its corresponding type declarations. …typescript/tsc · compiler-diagnosticEvidence quality: complete · Environment variants: 1 · First recorded: 2026-09-01 · Last seen: 2026-09-01
-
observed PROJECT_COMPILE exit 2 TS7006 ×4 1.2.8 executionContext=node · moduleSystem=cjs · os=windows · runtime=node@24.13 sha256:21025cd78572…app/api/politicians/[id]/real-estates/route.ts(<n>,<n>): error TS7006: Parameter <str> implicitly has an <str> type. …typescript/tsc · compiler-diagnosticEvidence quality: complete · Environment variants: 1 · First recorded: 2026-09-01 · Last seen: 2026-09-01
-
observed PROJECT_COMPILE exit 2 TS2561 ×4 1.2.8 executionContext=node · moduleSystem=cjs · os=windows · runtime=node@24.13 sha256:5f96e966539e…app/api/politicians/[id]/real-estates/route.ts(<n>,<n>): error TS2561: Object literal may only specify known properties, but <str> does not exist in type …typescript/tsc · compiler-diagnosticEvidence quality: complete · Environment variants: 1 · First recorded: 2026-09-01 · Last seen: 2026-09-01
Showing the 12 most-reported of 306 recorded failure clusters. The rest are single reports.