Registrosnpmmagic-string0.30.21MagicString
Exemplos publicados
- magic-string 0.30.21: MagicString, MagicString.prototype.overwrite, MagicString.prototype.appendLeft Esta rede oferece uma coisa: uma amostra que compila. Ela a executou em um sandbox e guardou o recibo assinado. Não classifica nem garante nada — se o mesmo código compila onde você está, ela não mediu. HOWMagicStringMagicString.prototype.overwriteMagicString.prototype.appendLeftMagicString.prototype.generateMapMagicString.prototype.toStringnode 22.23.2 MIT-0 · 2026-08-27
Matriz de compatibilidade
Observações no nível do projeto e verificações de símbolo/contrato são contadas separadamente e nunca somadas.
Estas contagens não distinguem como o símbolo foi chamado: sobrecargas, formatos de argumentos e opções são agrupados. O que uma forma de chamada específica faz é provado pelo contrato de uma amostra, não por estes números.
| Ambiente | Confiança | Observações | Verificado | Taxa de aprovação | Peers | Visto por último |
|---|---|---|---|---|---|---|
| node 22 · JS · npm · linux musl · docker
Verificado: CONTRACT 1✓
|
LOW | 0 | 1 | 100% | 0 · 1✓ | 2026-08-27 |
snapshot · 2026-09-15
Clusters de falha
-
observado UNKNOWN exit 1 ERR_PNPM_RECURSIVE_RUN_FIRST_FAIL Lacuna de evidência ×32 0.30.21 executionContext=node · moduleSystem=esm · os=windows · runtime=node@24.13 sha256:9f91c9753081…(node:<n>) ExperimentalWarning: SQLite is an experimental feature and might change at any time …pnpm · unclassified-diagnostic · outer pnpm · gap stage-unknownQualidade da evidência: complete · Variantes de ambiente: 1 · Primeiro registro: 2026-09-01 · Visto por último: 2026-09-17Candidato a reverificação diagnóstica
-
observado UNKNOWN exit 1 ERR_PNPM_RECURSIVE_EXEC_FIRST_FAIL Lacuna de evidência ×28 0.30.21 executionContext=node · moduleSystem=esm · os=windows · runtime=node@24.13 sha256:979755e6489d…(node:<n>) ExperimentalWarning: SQLite is an experimental feature and might change at any time …pnpm · unclassified-diagnostic · outer pnpm · gap stage-unknownQualidade da evidência: complete · Variantes de ambiente: 1 · Primeiro registro: 2026-09-01 · Visto por último: 2026-09-15Candidato a reverificação diagnóstica
-
observado PROCESS_START process start failed Lacuna de evidência ×18 0.30.21 executionContext=node sha256:c12549970456…· structured-termination · gap diagnostic-missingQualidade da evidência: partial · Variantes de ambiente: 3 · Primeiro registro: 2026-08-30 · Visto por último: 2026-09-16Candidato a reverificação diagnóstica
-
observado UNKNOWN exit 1 ERR_PNPM_RECURSIVE_EXEC_FIRST_FAIL Lacuna de evidência ×11 0.30.21 executionContext=node · moduleSystem=esm · os=windows · runtime=node@24.13 sha256:73873d2c4aed…<str> is not recognized as an internal or external command, · operable program or batch file. · undefined …pnpm · unclassified-diagnostic · outer pnpm · gap stage-unknownQualidade da evidência: complete · Variantes de ambiente: 1 · Primeiro registro: 2026-09-01 · Visto por último: 2026-09-01Candidato a reverificação diagnóstica
-
observado PROJECT_TEST exit 1 ELIFECYCLE ×10 0.30.21 executionContext=node · moduleSystem=esm · os=windows · runtime=node@24.13 sha256:7711694d48fa…ELIFECYCLE Test failed. See above for more details.javascript/test-runner · test-runner-diagnostic · outer pnpm testQualidade da evidência: complete · Variantes de ambiente: 1 · Primeiro registro: 2026-08-29 · Visto por último: 2026-09-01
-
observado UNKNOWN exit 1 Lacuna de evidência ×9 0.30.21 executionContext=node · moduleSystem=cjs · os=linux · runtime=node@22.23 sha256:9be950af9140…Traceback (most recent call last): · File <str>, line 1, in <module> · ModuleNotFoundError: No module named <str>python3 · unclassified-diagnostic · outer python3 · gap stage-unknownQualidade da evidência: complete · Variantes de ambiente: 1 · Primeiro registro: 2026-08-30 · Visto por último: 2026-08-31Candidato a reverificação diagnóstica
-
observado PROJECT_PROCESS ERR_ASSERTION Lacuna de evidência ×8 0.30.21 executionContext=nodeQualidade da evidência: legacy-evidence-incomplete · Variantes de ambiente: 3 · Primeiro registro: 2026-08-14 · Visto por último: 2026-08-30Candidato a reverificação diagnóstica
-
observado PROJECT_COMPILE exit 2 TS2307 ×8 0.30.8 → 0.30.21 executionContext=node · moduleSystem=cjs · os=windows · runtime=node@24.13 sha256:0470f88d95bb…lib/hooks/queries/index.ts(<n>,<n>): error TS2307: Cannot find module <str> or its corresponding type declarations. …typescript/tsc · compiler-diagnosticQualidade da evidência: complete · Variantes de ambiente: 1 · Primeiro registro: 2026-09-01 · Visto por último: 2026-09-01
-
observado PROJECT_COMPILE exit 2 TS7006 ×8 0.30.8 → 0.30.21 executionContext=node · moduleSystem=cjs · os=windows · runtime=node@24.13 sha256:21025cd78572…app/api/politicians/[id]/real-estates/route.ts(<n>,<n>): error TS7006: Parameter <str> implicitly has an <str> type. …typescript/tsc · compiler-diagnosticQualidade da evidência: complete · Variantes de ambiente: 1 · Primeiro registro: 2026-09-01 · Visto por último: 2026-09-01
-
observado PROJECT_COMPILE exit 2 TS2561 ×8 0.30.8 → 0.30.21 executionContext=node · moduleSystem=cjs · os=windows · runtime=node@24.13 sha256:5f96e966539e…app/api/politicians/[id]/real-estates/route.ts(<n>,<n>): error TS2561: Object literal may only specify known properties, but <str> does not exist in type …typescript/tsc · compiler-diagnosticQualidade da evidência: complete · Variantes de ambiente: 1 · Primeiro registro: 2026-09-01 · Visto por último: 2026-09-01
-
observado PROJECT_COMPILE exit 2 TS2345 ×8 0.30.8 → 0.30.21 executionContext=node · moduleSystem=cjs · os=windows · runtime=node@24.13 sha256:7e077f646acc…lib/api/real-estate-statistics.ts(<n>,<n>): error TS2345: Argument of type <str> is not assignable to parameter of type <str>.typescript/tsc · compiler-diagnosticQualidade da evidência: complete · Variantes de ambiente: 1 · Primeiro registro: 2026-09-01 · Visto por último: 2026-09-01
-
observado PROJECT_COMPILE exit 2 TS2551 ×8 0.30.8 → 0.30.21 executionContext=node · moduleSystem=cjs · os=windows · runtime=node@24.13 sha256:8a1ebc675f2b…app/api/politicians/[id]/real-estates/route.ts(<n>,<n>): error TS2551: Property <str> does not exist on type <str>. Did you mean <str>? …typescript/tsc · compiler-diagnosticQualidade da evidência: complete · Variantes de ambiente: 1 · Primeiro registro: 2026-09-01 · Visto por último: 2026-09-01
Mostrando os 12 mais relatados de 315 grupos de falhas registrados. O resto são relatos únicos.