Записиnpmmagic-string0.30.21MagicString.prototype.appendLeft
Опубликованные примеры
- magic-string 0.30.21: MagicString, MagicString.prototype.overwrite, MagicString.prototype.appendLeft Эта сеть предлагает одно: образец, который собирается. Она запустила его в песочнице и сохранила подписанную квитанцию. Она ничего не оценивает и ничего не гарантирует — собирается ли тот же код у вас, она не измеряла. HOWMagicStringMagicString.prototype.overwriteMagicString.prototype.appendLeftMagicString.prototype.generateMapMagicString.prototype.toStringnode 22.23.2 MIT-0 · 2026-08-27
Матрица совместимости
Наблюдения уровня проекта и проверки символов/контрактов считаются раздельно и никогда не суммируются.
Эти числа не различают, как именно был вызван символ: перегрузки, наборы аргументов и опции считаются вместе. Что делает конкретная форма вызова, доказывает контракт образца, а не эти цифры.
| Окружение | Достоверность | Наблюдения | Проверено | Доля успешных | Пиры | Последнее наблюдение |
|---|---|---|---|---|---|---|
| node 22 · JS · npm · linux musl · docker
Проверено: CONTRACT 1✓
|
LOW | 0 | 1 | 100 % | 0 · 1✓ | 2026-08-27 |
snapshot · 2026-09-15
Кластеры сбоев
-
наблюдалось UNKNOWN exit 1 ERR_PNPM_RECURSIVE_RUN_FIRST_FAIL Пробел в данных ×32 0.30.21 executionContext=node · moduleSystem=esm · os=windows · runtime=node@24.13 sha256:9f91c9753081…(node:<n>) ExperimentalWarning: SQLite is an experimental feature and might change at any time …pnpm · unclassified-diagnostic · outer pnpm · gap stage-unknownКачество данных: complete · Варианты среды: 1 · Первая запись: 2026-09-01 · Последнее наблюдение: 2026-09-17Кандидат на диагностическую перепроверку
-
наблюдалось UNKNOWN exit 1 ERR_PNPM_RECURSIVE_EXEC_FIRST_FAIL Пробел в данных ×28 0.30.21 executionContext=node · moduleSystem=esm · os=windows · runtime=node@24.13 sha256:979755e6489d…(node:<n>) ExperimentalWarning: SQLite is an experimental feature and might change at any time …pnpm · unclassified-diagnostic · outer pnpm · gap stage-unknownКачество данных: complete · Варианты среды: 1 · Первая запись: 2026-09-01 · Последнее наблюдение: 2026-09-15Кандидат на диагностическую перепроверку
-
наблюдалось PROCESS_START process start failed Пробел в данных ×18 0.30.21 executionContext=node sha256:c12549970456…· structured-termination · gap diagnostic-missingКачество данных: partial · Варианты среды: 3 · Первая запись: 2026-08-30 · Последнее наблюдение: 2026-09-16Кандидат на диагностическую перепроверку
-
наблюдалось UNKNOWN exit 1 ERR_PNPM_RECURSIVE_EXEC_FIRST_FAIL Пробел в данных ×11 0.30.21 executionContext=node · moduleSystem=esm · os=windows · runtime=node@24.13 sha256:73873d2c4aed…<str> is not recognized as an internal or external command, · operable program or batch file. · undefined …pnpm · unclassified-diagnostic · outer pnpm · gap stage-unknownКачество данных: complete · Варианты среды: 1 · Первая запись: 2026-09-01 · Последнее наблюдение: 2026-09-01Кандидат на диагностическую перепроверку
-
наблюдалось PROJECT_TEST exit 1 ELIFECYCLE ×10 0.30.21 executionContext=node · moduleSystem=esm · os=windows · runtime=node@24.13 sha256:7711694d48fa…ELIFECYCLE Test failed. See above for more details.javascript/test-runner · test-runner-diagnostic · outer pnpm testКачество данных: complete · Варианты среды: 1 · Первая запись: 2026-08-29 · Последнее наблюдение: 2026-09-01
-
наблюдалось UNKNOWN exit 1 Пробел в данных ×9 0.30.21 executionContext=node · moduleSystem=cjs · os=linux · runtime=node@22.23 sha256:9be950af9140…Traceback (most recent call last): · File <str>, line 1, in <module> · ModuleNotFoundError: No module named <str>python3 · unclassified-diagnostic · outer python3 · gap stage-unknownКачество данных: complete · Варианты среды: 1 · Первая запись: 2026-08-30 · Последнее наблюдение: 2026-08-31Кандидат на диагностическую перепроверку
-
наблюдалось PROJECT_PROCESS ERR_ASSERTION Пробел в данных ×8 0.30.21 executionContext=nodeКачество данных: legacy-evidence-incomplete · Варианты среды: 3 · Первая запись: 2026-08-14 · Последнее наблюдение: 2026-08-30Кандидат на диагностическую перепроверку
-
наблюдалось PROJECT_COMPILE exit 2 TS2307 ×8 0.30.8 → 0.30.21 executionContext=node · moduleSystem=cjs · os=windows · runtime=node@24.13 sha256:0470f88d95bb…lib/hooks/queries/index.ts(<n>,<n>): error TS2307: Cannot find module <str> or its corresponding type declarations. …typescript/tsc · compiler-diagnosticКачество данных: complete · Варианты среды: 1 · Первая запись: 2026-09-01 · Последнее наблюдение: 2026-09-01
-
наблюдалось PROJECT_COMPILE exit 2 TS7006 ×8 0.30.8 → 0.30.21 executionContext=node · moduleSystem=cjs · os=windows · runtime=node@24.13 sha256:21025cd78572…app/api/politicians/[id]/real-estates/route.ts(<n>,<n>): error TS7006: Parameter <str> implicitly has an <str> type. …typescript/tsc · compiler-diagnosticКачество данных: complete · Варианты среды: 1 · Первая запись: 2026-09-01 · Последнее наблюдение: 2026-09-01
-
наблюдалось PROJECT_COMPILE exit 2 TS2561 ×8 0.30.8 → 0.30.21 executionContext=node · moduleSystem=cjs · os=windows · runtime=node@24.13 sha256:5f96e966539e…app/api/politicians/[id]/real-estates/route.ts(<n>,<n>): error TS2561: Object literal may only specify known properties, but <str> does not exist in type …typescript/tsc · compiler-diagnosticКачество данных: complete · Варианты среды: 1 · Первая запись: 2026-09-01 · Последнее наблюдение: 2026-09-01
-
наблюдалось PROJECT_COMPILE exit 2 TS2345 ×8 0.30.8 → 0.30.21 executionContext=node · moduleSystem=cjs · os=windows · runtime=node@24.13 sha256:7e077f646acc…lib/api/real-estate-statistics.ts(<n>,<n>): error TS2345: Argument of type <str> is not assignable to parameter of type <str>.typescript/tsc · compiler-diagnosticКачество данных: complete · Варианты среды: 1 · Первая запись: 2026-09-01 · Последнее наблюдение: 2026-09-01
-
наблюдалось PROJECT_COMPILE exit 2 TS2551 ×8 0.30.8 → 0.30.21 executionContext=node · moduleSystem=cjs · os=windows · runtime=node@24.13 sha256:8a1ebc675f2b…app/api/politicians/[id]/real-estates/route.ts(<n>,<n>): error TS2551: Property <str> does not exist on type <str>. Did you mean <str>? …typescript/tsc · compiler-diagnosticКачество данных: complete · Варианты среды: 1 · Первая запись: 2026-09-01 · Последнее наблюдение: 2026-09-01
Показаны 12 наиболее часто сообщаемых из 315 записанных кластеров отказов. Остальные — единичные сообщения.