Recordsnpmlightningcss1.33.0lightningcss.bundle
OS × runtime at a glance
Reading a cell: The number is how many recorded observations the rate divides — one build files an observation per stage it reached, so it counts neither builds nor machines nor people. The document beside it is a different fact from a different source: whether a sample exists at that coordinate, and how our own run of it went there.
- no sample at this coordinate yet
- there is a sample here, and nothing of ours has run it at this coordinate yet
- there is a sample here, and our run of it at this coordinate came back clean
- there is a sample here, and our run of it at this coordinate failed
- there is a sample here, and this coordinate records both a passing and a failing run of it
- nothing recorded — unknown, never "works" and never "broken"
- there is a level below this cell — click to open it
A document means there is a sample at that coordinate. Whether one EXISTS is a fact about this release and this API and does not change with OS, runtime or package manager; its COLOUR is how that sample ran in the environment you are looking at.
Published samples
- lightningcss 1.33.0: bundle This network offers one thing: a sample that builds. It ran the sample in a sandbox and kept the signed receipt. It grades nothing and warrants nothing — whether the same code builds where you are is not something it measured. HOWbundlenode 22.23.2 MIT-0 · 2026-09-02
- lightningcss 1.33.0: bundle This network offers one thing: a sample that builds. It ran the sample in a sandbox and kept the signed receipt. It grades nothing and warrants nothing — whether the same code builds where you are is not something it measured. HOWlightningcss.bundlenode 22.23.2 MIT-0 · 2026-09-05
Compatibility matrix
Project-level observations and symbol/contract verifications are counted separately and never combined.
These counts do not distinguish how the symbol was called: overloads, argument shapes and options are pooled together. What a particular call shape does is proven by a sample's contract, not by these numbers.
| Environment | Confidence | Observations | Verified | Pass rate | Peers | Last seen |
|---|---|---|---|---|---|---|
| node 22 · JS · npm · linux glibc · docker
Observations: PROJECT_TEST 1✓ — Verified: CONTRACT 1✓
|
LOW | 1 | 1 | 100% | 1 · 1✓ | 2026-09-17 |
| node 22.23 · JS · npm · linux glibc
Observations: PROJECT_PROCESS 1✓
|
LOW | 1 | 0 | 100% | 1 | 2026-09-02 |
| node 22.23 · JS · npm · linux glibc
Observations: PROJECT_PROCESS 1✓
|
LOW | 1 | 0 | 100% | 1 | 2026-09-05 |
snapshot · 2026-09-17
Failure clusters
-
observed PROJECT_PROCESS ERR_MODULE_NOT_FOUND Evidence gap ×3 1.33.0 executionContext=node · moduleSystem=esm · os=windows · runtime=node@24.13Evidence quality: legacy-evidence-incomplete · Environment variants: 1 · First recorded: 2026-08-14 · Last seen: 2026-08-14Diagnostic re-verification candidate
-
observed UNKNOWN exit 1 ERR_ASSERTION Evidence gap ×2 1.33.0 executionContext=node · moduleSystem=esm · os=windows · runtime=node@24.13 sha256:340c5f78ca35…Image hunterzo-egress-lab:local Building · Image hunterzo-egress-lab:local Built · Network hunterzo-egress-lab_fixture_net Creating …· unclassified-diagnostic · gap stage-unknownEvidence quality: complete · Environment variants: 1 · First recorded: 2026-09-14 · Last seen: 2026-09-14Diagnostic re-verification candidate
-
observed PROJECT_TEST exit 1 ERR_LOAD_URL ×1 1.33.0 executionContext=node · moduleSystem=esm · os=linux · runtime=node@22.23 sha256:a60e7101af87…Contract test failed: Error: Failed to load custom Reporter from basic · at loadCustomReporterModule (fil<path>:<n>:<n>) · at fil<path>:<n>:<n> …javascript/test-runner · test-runner-diagnostic · outer npm testEvidence quality: complete · Environment variants: 1 · First recorded: 2026-08-31 · Last seen: 2026-08-31
-
observed UNKNOWN exit 1 Evidence gap ×1 1.33.0 executionContext=node · moduleSystem=esm · os=linux · runtime=node@22.23 sha256:0ce61af3f1a8…<url>]:<n> · const res = await babelPlugin.transform.handler(code, <str>); · ^ · TypeError: Cannot read properties of undefined (reading <str>)node · unclassified-diagnostic · outer node · gap stage-unknownEvidence quality: complete · Environment variants: 1 · First recorded: 2026-09-01 · Last seen: 2026-09-01Diagnostic re-verification candidate
-
observed UNKNOWN exit 1 Evidence gap ×1 1.33.0 executionContext=node · moduleSystem=esm · os=linux · runtime=node@22.23 sha256:249ecd4b894f…fil<path>:<n> · skipFastRefresh = isProduction || config.command === <str> || config.server.hmr === false; · ^ …node · unclassified-diagnostic · outer node · gap stage-unknownEvidence quality: complete · Environment variants: 1 · First recorded: 2026-09-01 · Last seen: 2026-09-01Diagnostic re-verification candidate
-
observed UNKNOWN exit 1 Evidence gap ×1 1.33.0 executionContext=node · moduleSystem=esm · os=linux · runtime=node@22.23 sha256:8a6df6b44383…fil<path>:<n> · if (config.experimental.bundledDev) isBundledDev = true; · ^ · TypeError: Cannot read properties of undefined (reading <str>)node · unclassified-diagnostic · outer node · gap stage-unknownEvidence quality: complete · Environment variants: 1 · First recorded: 2026-09-01 · Last seen: 2026-09-01Diagnostic re-verification candidate
-
observed UNKNOWN exit 1 ERR_ASSERTION Evidence gap ×1 1.33.0 executionContext=node · moduleSystem=esm · os=linux · runtime=node@22.23 sha256:8b0e67a45c04…node:internal/modules/run_main:<n> · triggerUncaughtException( · ^ · AssertionError [ERR_ASSERTION]: resolves <path> to virtual module IDnode · unclassified-diagnostic · outer node · gap stage-unknownEvidence quality: complete · Environment variants: 1 · First recorded: 2026-09-01 · Last seen: 2026-09-01Diagnostic re-verification candidate
-
observed UNKNOWN exit 1 ERR_ASSERTION Evidence gap ×1 1.33.0 executionContext=node · moduleSystem=esm · os=linux · runtime=node@22.23 sha256:9088da2c451a…node:internal/modules/run_main:<n> · triggerUncaughtException( · ^ · AssertionError [ERR_ASSERTION]: load code contains RefreshRuntimenode · unclassified-diagnostic · outer node · gap stage-unknownEvidence quality: complete · Environment variants: 1 · First recorded: 2026-09-01 · Last seen: 2026-09-01Diagnostic re-verification candidate
-
observed UNKNOWN exit 1 Evidence gap ×1 1.33.0 executionContext=node · moduleSystem=esm · os=linux · runtime=node@22.23 sha256:aaa882de0091…fil<path>:<n> · const hooks = config.plugins.map((plugin) => plugin.api?.reactBabel).filter(defined); · ^ …node · unclassified-diagnostic · outer node · gap stage-unknownEvidence quality: complete · Environment variants: 1 · First recorded: 2026-09-01 · Last seen: 2026-09-01Diagnostic re-verification candidate
-
observed UNKNOWN exit 1 ERR_PACKAGE_PATH_NOT_EXPORTED Evidence gap ×1 1.33.0 executionContext=node · moduleSystem=esm · os=linux · runtime=node@22.23 sha256:b9a7518ba7bb…node:internal/modules/esm/resolve:<n> · return new ERR_PACKAGE_PATH_NOT_EXPORTED( · ^ …node · unclassified-diagnostic · outer node · gap stage-unknownEvidence quality: complete · Environment variants: 1 · First recorded: 2026-09-01 · Last seen: 2026-09-01Diagnostic re-verification candidate
-
observed UNKNOWN exit 1 ERR_ASSERTION Evidence gap ×1 1.33.0 executionContext=node · moduleSystem=cjs · os=linux · runtime=node@22.23 sha256:986d98189e70…node:internal/modules/run_main:<n> · triggerUncaughtException( · ^ · AssertionError [ERR_ASSERTION]: Expected values to be strictly equal:node · unclassified-diagnostic · outer node · gap stage-unknownEvidence quality: complete · Environment variants: 1 · First recorded: 2026-09-04 · Last seen: 2026-09-04Diagnostic re-verification candidate
-
observed UNKNOWN exit 1 ERR_PACKAGE_PATH_NOT_EXPORTED Evidence gap ×1 1.33.0 executionContext=node · moduleSystem=cjs · os=linux · runtime=node@22.23 sha256:e72340c7e3d4…node:internal/modules/cjs/loader:<n> · throw e; · ^ · Error [ERR_PACKAGE_PATH_NOT_EXPORTED]: Package subpath <str> is not defined by <str> in <path>node · unclassified-diagnostic · outer node · gap stage-unknownEvidence quality: complete · Environment variants: 1 · First recorded: 2026-09-04 · Last seen: 2026-09-04Diagnostic re-verification candidate
Showing the 12 most-reported of 43 recorded failure clusters. The rest are single reports.