Registrosnpmjson52.2.3json5.stringify
OS × runtime de un vistazo
Cómo leer una celda: El número son las observaciones registradas entre las que divide la tasa: una compilación deja una observación por cada etapa que alcanzó, así que no cuenta compilaciones, ni máquinas, ni personas. El documento de al lado es otro hecho de otra fuente: si hay una muestra en esa coordenada y cómo fue nuestra ejecución de ella allí.
- todavía no hay muestra en esta coordenada
- hay una muestra aquí y todavía no la hemos ejecutado en esta coordenada
- hay una muestra aquí y nuestra ejecución en esta coordenada terminó limpia
- hay una muestra aquí y nuestra ejecución en esta coordenada falló
- hay una muestra aquí y esta coordenada registra a la vez una ejecución con éxito y otra con fallo
- nada registrado — desconocido, ni «funciona» ni «roto»
- hay un nivel bajo esta celda: haz clic para abrirlo
Un documento significa que hay una muestra en esa coordenada. Que EXISTA es un hecho sobre esta versión y esta API y no cambia con el sistema operativo, el runtime ni el gestor de paquetes; su COLOR es cómo se ejecutó esa muestra en el entorno que estás mirando.
Ejemplos publicados
- json5 2.2.3: parse and stringify JSON5 with comments, trailing commas, and unquoted keys Esta red ofrece una sola cosa: una muestra que compila. La ejecutó en un sandbox y guardó el recibo firmado. No califica ni garantiza nada: si el mismo código compila donde estás no es algo que haya medido. HOWJSON5.parseJSON5.stringifynode 22.23.2 MIT-0 · 2026-08-26
- json5 2.2.3: stringify Esta red ofrece una sola cosa: una muestra que compila. La ejecutó en un sandbox y guardó el recibo firmado. No califica ni garantiza nada: si el mismo código compila donde estás no es algo que haya medido. HOWjson5.stringifynode 22.23.2 MIT-0 · 2026-08-26
Matriz de compatibilidad
Las observaciones a nivel de proyecto y las verificaciones de símbolo/contrato se cuentan por separado y nunca se combinan.
Estos recuentos no distinguen cómo se llamó al símbolo: las sobrecargas, las formas de los argumentos y las opciones se agrupan. Lo que hace una forma de llamada concreta lo demuestra el contrato de una muestra, no estas cifras.
| Entorno | Confianza | Observaciones | Verificado | Tasa de éxito | Pares | Última observación |
|---|---|---|---|---|---|---|
| node 22 · JS · npm · linux glibc · docker
Observaciones: PROJECT_TEST 1✓ — Verificado: CONTRACT 1✓
|
LOW | 1 | 1 | 100% | 1 · 1✓ | 2026-09-07 |
| node 22 · JS · npm · linux musl · docker
Verificado: CONTRACT 1✓
|
LOW | 0 | 1 | 100% | 0 · 1✓ | 2026-08-26 |
| node 22.23 · JS · npm · linux glibc
Observaciones: PROJECT_PROCESS 2✓
|
LOW | 2 | 0 | 100% | 1 | 2026-08-29 |
| node 22.23 · JS · npm · linux glibc
Observaciones: PROJECT_PROCESS 2✓
|
LOW | 2 | 0 | 100% | 1 | 2026-08-29 |
snapshot · 2026-09-15
Clústeres de fallos
-
observado UNKNOWN exit 1 ERR_PNPM_RECURSIVE_RUN_FIRST_FAIL Brecha de evidencia ×32 2.2.3 executionContext=node · moduleSystem=esm · os=windows · runtime=node@24.13 sha256:9f91c9753081…(node:<n>) ExperimentalWarning: SQLite is an experimental feature and might change at any time …pnpm · unclassified-diagnostic · outer pnpm · gap stage-unknownCalidad de evidencia: complete · Variantes de entorno: 1 · Primer registro: 2026-09-01 · Última observación: 2026-09-17Candidato a reverificación diagnóstica
-
observado UNKNOWN exit 1 ERR_PNPM_RECURSIVE_EXEC_FIRST_FAIL Brecha de evidencia ×28 2.2.3 executionContext=node · moduleSystem=esm · os=windows · runtime=node@24.13 sha256:979755e6489d…(node:<n>) ExperimentalWarning: SQLite is an experimental feature and might change at any time …pnpm · unclassified-diagnostic · outer pnpm · gap stage-unknownCalidad de evidencia: complete · Variantes de entorno: 1 · Primer registro: 2026-09-01 · Última observación: 2026-09-15Candidato a reverificación diagnóstica
-
observado UNKNOWN exit 1 ERR_PNPM_RECURSIVE_EXEC_FIRST_FAIL Brecha de evidencia ×11 2.2.3 executionContext=node · moduleSystem=esm · os=windows · runtime=node@24.13 sha256:73873d2c4aed…<str> is not recognized as an internal or external command, · operable program or batch file. · undefined …pnpm · unclassified-diagnostic · outer pnpm · gap stage-unknownCalidad de evidencia: complete · Variantes de entorno: 1 · Primer registro: 2026-09-01 · Última observación: 2026-09-01Candidato a reverificación diagnóstica
-
observado PROJECT_TEST exit 1 ELIFECYCLE ×10 2.2.3 executionContext=node · moduleSystem=esm · os=windows · runtime=node@24.13 sha256:7711694d48fa…ELIFECYCLE Test failed. See above for more details.javascript/test-runner · test-runner-diagnostic · outer pnpm testCalidad de evidencia: complete · Variantes de entorno: 1 · Primer registro: 2026-08-29 · Última observación: 2026-09-01
-
observado PROJECT_PROCESS ERR_ASSERTION Brecha de evidencia ×8 2.2.3 executionContext=node · os=linux · runtime=node@22.23Calidad de evidencia: legacy-evidence-incomplete · Variantes de entorno: 2 · Primer registro: 2026-08-20 · Última observación: 2026-08-23Candidato a reverificación diagnóstica
-
observado PROJECT_COMPILE exit 2 TS2307 ×8 1.0.2 → 2.2.3 executionContext=node · moduleSystem=cjs · os=windows · runtime=node@24.13 sha256:0470f88d95bb…lib/hooks/queries/index.ts(<n>,<n>): error TS2307: Cannot find module <str> or its corresponding type declarations. …typescript/tsc · compiler-diagnosticCalidad de evidencia: complete · Variantes de entorno: 1 · Primer registro: 2026-09-01 · Última observación: 2026-09-01
-
observado PROJECT_COMPILE exit 2 TS7006 ×8 1.0.2 → 2.2.3 executionContext=node · moduleSystem=cjs · os=windows · runtime=node@24.13 sha256:21025cd78572…app/api/politicians/[id]/real-estates/route.ts(<n>,<n>): error TS7006: Parameter <str> implicitly has an <str> type. …typescript/tsc · compiler-diagnosticCalidad de evidencia: complete · Variantes de entorno: 1 · Primer registro: 2026-09-01 · Última observación: 2026-09-01
-
observado PROJECT_COMPILE exit 2 TS2561 ×8 1.0.2 → 2.2.3 executionContext=node · moduleSystem=cjs · os=windows · runtime=node@24.13 sha256:5f96e966539e…app/api/politicians/[id]/real-estates/route.ts(<n>,<n>): error TS2561: Object literal may only specify known properties, but <str> does not exist in type …typescript/tsc · compiler-diagnosticCalidad de evidencia: complete · Variantes de entorno: 1 · Primer registro: 2026-09-01 · Última observación: 2026-09-01
-
observado PROJECT_COMPILE exit 2 TS2345 ×8 1.0.2 → 2.2.3 executionContext=node · moduleSystem=cjs · os=windows · runtime=node@24.13 sha256:7e077f646acc…lib/api/real-estate-statistics.ts(<n>,<n>): error TS2345: Argument of type <str> is not assignable to parameter of type <str>.typescript/tsc · compiler-diagnosticCalidad de evidencia: complete · Variantes de entorno: 1 · Primer registro: 2026-09-01 · Última observación: 2026-09-01
-
observado PROJECT_COMPILE exit 2 TS2551 ×8 1.0.2 → 2.2.3 executionContext=node · moduleSystem=cjs · os=windows · runtime=node@24.13 sha256:8a1ebc675f2b…app/api/politicians/[id]/real-estates/route.ts(<n>,<n>): error TS2551: Property <str> does not exist on type <str>. Did you mean <str>? …typescript/tsc · compiler-diagnosticCalidad de evidencia: complete · Variantes de entorno: 1 · Primer registro: 2026-09-01 · Última observación: 2026-09-01
-
observado PROJECT_COMPILE exit 2 TS2339 ×8 1.0.2 → 2.2.3 executionContext=node · moduleSystem=cjs · os=windows · runtime=node@24.13 sha256:e51205820175…lib/api/real-estate-map-addresses.ts(<n>,<n>): error TS2339: Property <str> does not exist on type <str>.typescript/tsc · compiler-diagnosticCalidad de evidencia: complete · Variantes de entorno: 1 · Primer registro: 2026-09-01 · Última observación: 2026-09-01
-
observado PROJECT_COMPILE exit 2 TS2305 ×8 1.0.2 → 2.2.3 executionContext=node · moduleSystem=cjs · os=windows · runtime=node@24.13 sha256:e7aa54217e13…app/api/politicians/[id]/real-estates/route.ts(<n>,<n>): error TS2305: Module <str> has no exported member <str>. …typescript/tsc · compiler-diagnosticCalidad de evidencia: complete · Variantes de entorno: 1 · Primer registro: 2026-09-01 · Última observación: 2026-09-01
Se muestran los 12 más reportados de 364 grupos de fallos registrados. El resto son reportes únicos.