Aufzeichnungennpmfind-up-simple1.0.1
Welches Symbol wo lief
Symbole × Betriebssysteme für diese Version. Zellen führen in den Kompatibilitätswürfel des Pakets.
Eine Zelle lesen: Die Zahl sind die aufgezeichneten Beobachtungen, durch die die Rate teilt — ein Build hinterlässt pro erreichter Stufe eine Beobachtung, also zählt sie weder Builds noch Maschinen noch Personen. Das Dokument daneben ist eine andere Tatsache aus einer anderen Quelle: ob an dieser Koordinate ein Sample existiert und wie unser eigener Lauf davon dort ausging.
- an dieser Koordinate noch kein Sample
- hier gibt es ein Sample, und wir haben es an dieser Koordinate noch nicht ausgeführt
- hier gibt es ein Sample, und unser Lauf an dieser Koordinate kam sauber zurück
- hier gibt es ein Sample, und unser Lauf an dieser Koordinate ist fehlgeschlagen
- hier gibt es ein Sample, und an dieser Koordinate sind ein bestandener und ein fehlgeschlagener Lauf verzeichnet
- nichts aufgezeichnet — unbekannt, weder „funktioniert“ noch „defekt“
- unter dieser Zelle liegt eine Ebene — zum Öffnen klicken
Ein Dokument bedeutet: An dieser Koordinate gibt es ein Sample. DASS es existiert, ist eine Aussage über diese Version und diese API und ändert sich nicht mit Betriebssystem, Runtime oder Paketmanager; seine FARBE sagt, wie dieses Sample in der Umgebung gelaufen ist, die Sie gerade ansehen.
Umgebungsdetails
Beobachtungen auf Projektebene und Symbol-/Contract-Verifizierungen werden getrennt gezählt und niemals zusammengerechnet.
Diese Zahlen unterscheiden nicht, wie das Symbol aufgerufen wurde: Überladungen, Argumentformen und Optionen werden zusammengefasst. Was eine bestimmte Aufrufform tut, beweist der Vertrag eines Samples – nicht diese Zahlen.
| Umgebung | Konfidenz | Beobachtungen | Verifiziert | Erfolgsquote | Peers | Zuletzt gesehen |
|---|---|---|---|---|---|---|
| node 22 · JS · npm · linux glibc · docker
Beobachtungen: PROJECT_LOAD 2✓ · PROJECT_TEST 2✓ — Nutzung: USED 2✓ — Verifiziert: CONTRACT 2✓
|
LOW | 4 +2 | 2 | 100 % | 1 · 1✓ | 2026-09-17 |
| node 22.23 · JS · npm · linux glibc
Beobachtungen: PROJECT_PROCESS 41✓ · PROJECT_RESOLVE 0✓ 1✕ — Nutzung: USED 24✓ — Verifiziert: PROCESS_START 0✓ 1✕ · UNKNOWN 0✓ 5✕
|
MEDIUM | 42 +24 | 6 | 85 % | 3 | 2026-09-14 |
| node 22.23 · JS · yarn · linux glibc
Beobachtungen: PROJECT_PROCESS 4✓
|
LOW | 4 | 0 | 100 % | 1 | 2026-09-07 |
| node 22.23 · JS · npm · linux glibc
Beobachtungen: PROJECT_PROCESS 18✓ · PROJECT_TEST 1✓ — Nutzung: USED 4✓ — Verifiziert: UNKNOWN 0✓ 1✕
|
MEDIUM | 19 +4 | 1 | 95 % | 2 | 2026-09-14 |
Aktuelle Fehler-Cluster
-
beobachtet PROCESS_START process start failed Beweislücke ×1 1.0.1 executionContext=node · moduleSystem=cjs · os=linux · runtime=node@22.23 sha256:c12549970456…· structured-termination · gap diagnostic-missingBeweisqualität: partial · Umgebungsvarianten: 1 · Zuerst erfasst: 2026-09-05 · Zuletzt gesehen: 2026-09-05Kandidat für diagnostische Neuprüfung
-
beobachtet PROJECT_RESOLVE exit 1 ×1 1.0.1 executionContext=node · moduleSystem=cjs · os=linux · runtime=node@22.23 sha256:15e1b71df43a…test_contract.go:<n>:<n>: no required module provides package golang.org/x/text/unicode/norm: go.mod file not found in current directory or any parent …go/module · resolve-diagnostic · outer go runBeweisqualität: complete · Umgebungsvarianten: 1 · Zuerst erfasst: 2026-09-05 · Zuletzt gesehen: 2026-09-05
-
beobachtet UNKNOWN exit 1 Beweislücke ×1 1.0.1 executionContext=node · moduleSystem=esm · os=linux · runtime=node@22.23 sha256:036052acb454…[eval]:<n> · const inst1 = plugin(api, { method: <str>, include: [<str>, <str>] }); · ^ · TypeError: plugin is not a functionnode · unclassified-diagnostic · outer node · gap stage-unknownBeweisqualität: complete · Umgebungsvarianten: 1 · Zuerst erfasst: 2026-09-05 · Zuletzt gesehen: 2026-09-05Kandidat für diagnostische Neuprüfung
-
beobachtet UNKNOWN exit 1 Beweislücke ×1 1.0.1 executionContext=node · moduleSystem=cjs · os=linux · runtime=node@22.23 sha256:138a106a5937…stat main.go: no such file or directorygo · unclassified-diagnostic · outer go run · gap stage-unknownBeweisqualität: complete · Umgebungsvarianten: 1 · Zuerst erfasst: 2026-09-05 · Zuletzt gesehen: 2026-09-05Kandidat für diagnostische Neuprüfung
-
beobachtet UNKNOWN exit 1 Beweislücke ×1 1.0.1 executionContext=node · moduleSystem=cjs · os=linux · runtime=node@22.23 sha256:69ab38336834…assertion 1 failed: expected text/plain; version=0.0.4; charset=utf-8, got text/plain; version=0.0.4; charset=utf-8; escaping=underscores · exit status 1go · unclassified-diagnostic · outer go run · gap stage-unknownBeweisqualität: complete · Umgebungsvarianten: 1 · Zuerst erfasst: 2026-09-05 · Zuletzt gesehen: 2026-09-05Kandidat für diagnostische Neuprüfung
-
beobachtet UNKNOWN exit 1 ERR_ASSERTION Beweislücke ×1 1.0.1 executionContext=node · moduleSystem=cjs · os=linux · runtime=node@22.23 sha256:761ce8fa9777…node:assert:<n> · throw new AssertionError(obj); · ^ · AssertionError [ERR_ASSERTION]: Should yield 4 tokens for const answer = 42;node · unclassified-diagnostic · outer node · gap stage-unknownBeweisqualität: complete · Umgebungsvarianten: 1 · Zuerst erfasst: 2026-09-05 · Zuletzt gesehen: 2026-09-05Kandidat für diagnostische Neuprüfung
-
beobachtet UNKNOWN exit 1 ERR_MODULE_NOT_FOUND Beweislücke ×1 1.0.1 executionContext=node · moduleSystem=cjs · os=linux · runtime=node@22.23 sha256:88af852f99a8…node:internal/modules/package_json_reader:<n> · throw new ERR_MODULE_NOT_FOUND(packageName, fileURLToPath(base), null); · ^ …node · unclassified-diagnostic · outer node · gap stage-unknownBeweisqualität: complete · Umgebungsvarianten: 1 · Zuerst erfasst: 2026-09-05 · Zuletzt gesehen: 2026-09-05Kandidat für diagnostische Neuprüfung
-
beobachtet UNKNOWN exit 1 ERR_ASSERTION Beweislücke ×1 1.0.1 executionContext=node · moduleSystem=cjs · os=linux · runtime=node@22.23 sha256:986d98189e70…node:internal/modules/run_main:<n> · triggerUncaughtException( · ^ · AssertionError [ERR_ASSERTION]: Expected values to be strictly equal:node · unclassified-diagnostic · outer node · gap stage-unknownBeweisqualität: complete · Umgebungsvarianten: 1 · Zuerst erfasst: 2026-09-14 · Zuletzt gesehen: 2026-09-14Kandidat für diagnostische Neuprüfung
Symbole
- findUp 1 geteilt ×2 1 von 1 Läufen bestanden
- findUpSync 1 1 von 1 Läufen bestanden