记录npmbrowserslist4.28.9browserslist.readConfig
已发布的示例
- browserslist 4.28.9: readConfig 本网络只提供一件事:能构建的样本。它在沙箱中运行并保留签名回执。它不评级、不担保——同样的代码能否在你的环境构建,它没有测量过。 HOWbrowserslist.readConfignode 22.23.2 MIT-0 · 2026-09-05
兼容性矩阵
项目级观测与符号/契约验证分别统计,绝不合并。
这些计数不区分符号的调用方式:重载、参数形态和选项被合并统计。某一具体调用方式的行为由样本的契约证明,而不是由这些数字证明。
| 环境 | 置信度 | 观测 | 验证 | 通过率 | 节点 | 最近观测 |
|---|---|---|---|---|---|---|
| node 22 · JS · npm · linux glibc · docker
观测: PROJECT_TEST 1✓ — 验证: CONTRACT 1✓
|
LOW | 1 | 1 | 100% | 1 · 1✓ | 2026-09-17 |
snapshot · 2026-09-17
失败聚类
-
已观测 UNKNOWN exit 1 ERR_MODULE_NOT_FOUND 证据缺口 ×7 4.28.8 → 4.28.9 executionContext=node · os=linux · runtime=node@22.23 sha256:88af852f99a8…node:internal/modules/package_json_reader:<n> · throw new ERR_MODULE_NOT_FOUND(packageName, fileURLToPath(base), null); · ^ …node · unclassified-diagnostic · outer node · gap stage-unknown证据质量: complete · 环境变体: 2 · 首次记录: 2026-08-30 · 最近观测: 2026-09-05诊断复验候选
-
已观测 UNKNOWN exit 1 证据缺口 ×4 4.28.8 → 4.28.9 executionContext=node · moduleSystem=cjs · os=linux · runtime=node@22.23 sha256:91ad26545eb1…node:internal/modules/cjs/loader:<n> · throw err; · ^ · Error: Cannot find module <str>node · unclassified-diagnostic · outer node · gap stage-unknown证据质量: complete · 环境变体: 1 · 首次记录: 2026-08-31 · 最近观测: 2026-09-05诊断复验候选
-
已观测 PROCESS_START process start failed 证据缺口 ×3 4.28.8 → 4.28.9 executionContext=node sha256:c12549970456…· structured-termination · gap diagnostic-missing证据质量: partial · 环境变体: 2 · 首次记录: 2026-09-05 · 最近观测: 2026-09-16诊断复验候选
-
已观测 UNKNOWN exit 1 证据缺口 ×2 4.28.8 → 4.28.9 executionContext=node · moduleSystem=esm · os=linux · runtime=node@22.23 sha256:455451e1a14e…<url>]:<n> · import babel from <str>; · ^^^^^ · SyntaxError: The requested module <str> does not provide an export named <str>node · unclassified-diagnostic · outer node · gap stage-unknown证据质量: complete · 环境变体: 1 · 首次记录: 2026-09-02 · 最近观测: 2026-09-05诊断复验候选
-
已观测 PROJECT_RESOLVE exit 1 ×1 4.28.9 executionContext=node · moduleSystem=cjs · os=linux · runtime=node@22.23 sha256:15e1b71df43a…test_contract.go:<n>:<n>: no required module provides package golang.org/x/text/unicode/norm: go.mod file not found in current directory or any parent …go/module · resolve-diagnostic · outer go run证据质量: complete · 环境变体: 1 · 首次记录: 2026-09-05 · 最近观测: 2026-09-05
-
已观测 UNKNOWN exit 1 证据缺口 ×1 4.28.9 executionContext=node · moduleSystem=esm · os=linux · runtime=node@22.23 sha256:036052acb454…[eval]:<n> · const inst1 = plugin(api, { method: <str>, include: [<str>, <str>] }); · ^ · TypeError: plugin is not a functionnode · unclassified-diagnostic · outer node · gap stage-unknown证据质量: complete · 环境变体: 1 · 首次记录: 2026-09-05 · 最近观测: 2026-09-05诊断复验候选
-
已观测 UNKNOWN exit 1 证据缺口 ×1 4.28.9 executionContext=node · moduleSystem=cjs · os=linux · runtime=node@22.23 sha256:138a106a5937…stat main.go: no such file or directorygo · unclassified-diagnostic · outer go run · gap stage-unknown证据质量: complete · 环境变体: 1 · 首次记录: 2026-09-05 · 最近观测: 2026-09-05诊断复验候选
-
已观测 UNKNOWN exit 1 证据缺口 ×1 4.28.9 executionContext=node · moduleSystem=cjs · os=linux · runtime=node@22.23 sha256:69ab38336834…assertion 1 failed: expected text/plain; version=0.0.4; charset=utf-8, got text/plain; version=0.0.4; charset=utf-8; escaping=underscores · exit status 1go · unclassified-diagnostic · outer go run · gap stage-unknown证据质量: complete · 环境变体: 1 · 首次记录: 2026-09-05 · 最近观测: 2026-09-05诊断复验候选
-
已观测 UNKNOWN exit 1 ERR_ASSERTION 证据缺口 ×1 4.28.9 executionContext=node · moduleSystem=cjs · os=linux · runtime=node@22.23 sha256:761ce8fa9777…node:assert:<n> · throw new AssertionError(obj); · ^ · AssertionError [ERR_ASSERTION]: Should yield 4 tokens for const answer = 42;node · unclassified-diagnostic · outer node · gap stage-unknown证据质量: complete · 环境变体: 1 · 首次记录: 2026-09-05 · 最近观测: 2026-09-05诊断复验候选
-
已观测 UNKNOWN exit 1 ERR_ASSERTION 证据缺口 ×1 4.28.9 executionContext=node · moduleSystem=esm · os=linux · runtime=node@22.23 sha256:ac1a96fa941c…Contract test failed: AssertionError [ERR_ASSERTION]: out/preload/index.js must be created by build · at run (<url>) { · generatedMessage: false, …node · unclassified-diagnostic · outer node · gap stage-unknown证据质量: complete · 环境变体: 1 · 首次记录: 2026-09-06 · 最近观测: 2026-09-06诊断复验候选