Relevésnpmajv6.15.0ajv.Ajv
Matrice de compatibilité
Les observations au niveau projet et les vérifications de symbole/contrat sont comptées séparément et jamais additionnées.
Ces chiffres ne distinguent pas la façon dont le symbole a été appelé : surcharges, formes d'arguments et options sont regroupées. Ce que fait une forme d'appel précise est prouvé par le contrat d'un échantillon, pas par ces nombres.
| Environnement | Confiance | Observations | Vérifié | Taux de réussite | Pairs | Dernière observation |
|---|---|---|---|---|---|---|
| node 24.13 · JS · pnpm · windows
Observations: PROJECT_COMPILE 1✓ 7✕ · PROJECT_TEST 11✓ 2✕ — Vérifié: UNKNOWN 0✓ 6✕
|
ELEVATED FAILURE | 21 | 6 | 44 % | 1 | 2026-09-16 |
snapshot · 2026-09-16
Clusters d'échecs
-
observé UNKNOWN exit 1 ERR_PNPM_RECURSIVE_RUN_FIRST_FAIL Lacune de preuve ×62 6.15.0 → 8.20.0 executionContext=node · moduleSystem=esm · os=windows · runtime=node@24.13 ajv.Ajv sha256:9f91c9753081…(node:<n>) ExperimentalWarning: SQLite is an experimental feature and might change at any time …pnpm · unclassified-diagnostic · outer pnpm · gap stage-unknownQualité de preuve: complete · Variantes d’environnement: 1 · Premier relevé: 2026-09-01 · Dernière observation: 2026-09-14Candidat à une revérification diagnostique
-
observé UNKNOWN exit 1 ERR_PNPM_RECURSIVE_EXEC_FIRST_FAIL Lacune de preuve ×56 6.15.0 → 8.20.0 executionContext=node · moduleSystem=esm · os=windows · runtime=node@24.13 ajv.Ajv sha256:979755e6489d…(node:<n>) ExperimentalWarning: SQLite is an experimental feature and might change at any time …pnpm · unclassified-diagnostic · outer pnpm · gap stage-unknownQualité de preuve: complete · Variantes d’environnement: 1 · Premier relevé: 2026-09-01 · Dernière observation: 2026-09-14Candidat à une revérification diagnostique
-
observé UNKNOWN exit 1 Lacune de preuve ×22 6.15.0 → 8.17.1 → 8.20.0 executionContext=node · moduleSystem=cjs · os=linux · runtime=node@22.23 sha256:9be950af9140…Traceback (most recent call last): · File <str>, line 1, in <module> · ModuleNotFoundError: No module named <str>python3 · unclassified-diagnostic · outer python3 · gap stage-unknownQualité de preuve: complete · Variantes d’environnement: 1 · Premier relevé: 2026-08-31 · Dernière observation: 2026-09-02Candidat à une revérification diagnostique
-
observé UNKNOWN exit 1 ERR_PNPM_RECURSIVE_EXEC_FIRST_FAIL Lacune de preuve ×22 6.15.0 → 8.20.0 executionContext=node · moduleSystem=esm · os=windows · runtime=node@24.13 sha256:73873d2c4aed…<str> is not recognized as an internal or external command, · operable program or batch file. · undefined …pnpm · unclassified-diagnostic · outer pnpm · gap stage-unknownQualité de preuve: complete · Variantes d’environnement: 1 · Premier relevé: 2026-09-01 · Dernière observation: 2026-09-01Candidat à une revérification diagnostique
-
observé PROJECT_TEST exit 1 ELIFECYCLE ×20 6.15.0 → 8.20.0 executionContext=node · moduleSystem=esm · os=windows · runtime=node@24.13 ajv.Ajv sha256:7711694d48fa…ELIFECYCLE Test failed. See above for more details.javascript/test-runner · test-runner-diagnostic · outer pnpm testQualité de preuve: complete · Variantes d’environnement: 1 · Premier relevé: 2026-08-29 · Dernière observation: 2026-09-01
-
observé UNKNOWN exit 1 ELIFECYCLE Lacune de preuve ×14 6.15.0 → 8.20.0 executionContext=node · moduleSystem=esm · os=windows · runtime=node@24.13 sha256:f398b989dbea…> devhotel-workspace@0.4.3 lint <path> · > eslint . · <path> …pnpm · unclassified-diagnostic · outer pnpm · gap stage-unknownQualité de preuve: complete · Variantes d’environnement: 1 · Premier relevé: 2026-09-01 · Dernière observation: 2026-09-01Candidat à une revérification diagnostique
-
observé PROJECT_TEST Lacune de preuve ×10 6.15.0 → 8.20.0 executionContext=node · os=windowsQualité de preuve: legacy-evidence-incomplete · Variantes d’environnement: 3 · Premier relevé: 2026-08-21 · Dernière observation: 2026-08-25Candidat à une revérification diagnostique
-
observé UNKNOWN exit 1 ERR_PNPM_RECURSIVE_RUN_FIRST_FAIL Lacune de preuve ×10 6.15.0 → 8.20.0 executionContext=node · moduleSystem=esm · os=windows · runtime=node@24.13 sha256:0c4a78e30813…> devhotel-workspace@0.5.2 typecheck <path> · > pnpm -r typecheck · Scope: 4 of 5 workspace projects · packages/shared typecheck$ tsc --noEmitpnpm · unclassified-diagnostic · outer pnpm · gap stage-unknownQualité de preuve: complete · Variantes d’environnement: 1 · Premier relevé: 2026-09-13 · Dernière observation: 2026-09-13Candidat à une revérification diagnostique
-
observé UNKNOWN exit 1 ERR_ASSERTION Lacune de preuve ×8 6.15.0 → 8.17.1 → 8.20.0 executionContext=node · os=linux · runtime=node@22.23 sha256:986d98189e70…node:internal/modules/run_main:<n> · triggerUncaughtException( · ^ · AssertionError [ERR_ASSERTION]: Expected values to be strictly equal:node · unclassified-diagnostic · outer node · gap stage-unknownQualité de preuve: complete · Variantes d’environnement: 2 · Premier relevé: 2026-08-29 · Dernière observation: 2026-09-05Candidat à une revérification diagnostique
-
observé UNKNOWN exit 1 ERR_PNPM_RECURSIVE_EXEC_FIRST_FAIL Lacune de preuve ×8 6.15.0 → 8.20.0 executionContext=node · moduleSystem=esm · os=windows · runtime=node@24.13 sha256:d53178e9c23b…<str> is not recognized as an internal or external command, · operable program or batch file. · undefined · <path>pnpm · unclassified-diagnostic · outer pnpm · gap stage-unknownQualité de preuve: complete · Variantes d’environnement: 1 · Premier relevé: 2026-08-29 · Dernière observation: 2026-09-14Candidat à une revérification diagnostique
-
observé UNKNOWN exit 1 ERR_PNPM_RECURSIVE_RUN_FIRST_FAIL Lacune de preuve ×8 6.15.0 → 8.20.0 executionContext=node · moduleSystem=esm · os=windows · runtime=node@24.13 sha256:3b99548df64e…> devhotel-workspace@0.4.3 typecheck <path> · > pnpm -r typecheck · Scope: 4 of 5 workspace projects · packages/shared typecheck$ tsc --noEmitpnpm · unclassified-diagnostic · outer pnpm · gap stage-unknownQualité de preuve: complete · Variantes d’environnement: 1 · Premier relevé: 2026-09-01 · Dernière observation: 2026-09-01Candidat à une revérification diagnostique
-
observé PROCESS_START process start failed Lacune de preuve ×8 6.15.0 → 8.17.1 → 8.20.0 executionContext=node sha256:c12549970456…· structured-termination · gap diagnostic-missingQualité de preuve: partial · Variantes d’environnement: 2 · Premier relevé: 2026-09-02 · Dernière observation: 2026-09-16Candidat à une revérification diagnostique
Affichage des 12 plus signalés parmi 247 groupes d’échecs enregistrés. Le reste sont des signalements uniques.